program: Gaussian 09
title: 000222926
version: EM64L-G09RevD.01
frameworkgroup: C1[X(C9H11NO3)]
method: RPBEPBE
basis: SDD
operation: Freq
keyword: #p
keyword: freq=noraman
keyword: PBEPBE/SDD
title: #p freq=noraman PBEPBE/SDD
converged: YES YES NO NO
title: Mulliken charges:
elementType: O O O N C C C C C C C C C H H H H H H H H H H H
charge: -0.280604 -0.276733 -0.242020 0.000223 -0.300496 -0.256218 0.251917 0.206797 -0.279437 -0.281960 -0.322948 -0.323553 -0.495681 0.247660 0.243693 0.226767 0.200573 0.268942 0.269638 0.247865 0.245967 0.204427 0.237249 0.207931
chargesum: 0.00000
title: Mulliken charges with hydrogens summed into heavy atoms:
elementType: O O O N C C C C C C C C C
charge: -0.280604 -0.276733 -0.242020 0.000223 0.190857 0.171122 0.251917 0.206797 -0.010494 -0.012322 -0.075083 -0.077586 0.153926
polarizability: 1.59051140e+02 -8.99689697e-01 1.11222857e+02 1.05884147e+01 2.58250382e+00 6.59729686e+01
1716.lowfreq: -12.9047 -3.1917 -2.3905 -0.0012 -0.0007 -0.0004 31.9707 40.3907 56.9949
frequency: 31.7682 40.3620 56.9266 70.1070 92.3493 147.3866 157.7826 215.3248 221.3388 270.0835 308.9086 367.2160 409.7121 418.8445 462.2171 503.9672 657.5568 659.5844 689.7486 751.9801 763.2121 830.3238 848.9404 888.0060 899.3533 933.1298 958.4285 985.3892 989.4230 1050.5266 1060.6035 1068.9281 1083.2097 1092.5722 1107.2227 1133.5190 1161.5204 1199.6339 1210.7126 1251.0375 1271.1275 1301.8148 1323.6398 1328.7234 1387.8728 1399.8395 1440.1799 1455.9232 1459.5644 1461.5261 1469.9970 1494.3622 1554.5518 1581.7079 1626.8104 2930.5394 2941.3034 2997.2947 3008.3532 3049.7677 3108.6910 3134.2209 3140.1713 3143.1883 3172.8948 3186.8820
redmass: 3.8884 4.8554 2.4723 4.0924 3.1373 4.7554 4.6952 4.4603 1.2112 4.5576 5.3999 2.4950 3.9243 5.4044 4.8389 6.6678 6.3015 6.9667 4.2991 3.0866 3.7654 1.3041 1.5836 6.3345 1.2519 5.7510 6.5419 1.4085 1.4421 4.0641 2.6120 2.8504 2.1963 3.0988 1.3457 1.5281 1.4999 1.2061 1.3561 3.3902 1.1207 8.1144 1.4523 1.2874 1.3554 1.8924 1.1506 1.1895 1.0517 1.7119 1.0602 1.0763 8.0610 5.6968 10.4314 1.0374 1.0522 1.1059 1.1033 1.0581 1.0977 1.1087 1.0883 1.0918 1.0964 1.0959
irintensity: 0.8694 0.3648 3.2441 4.8546 2.5115 1.5684 1.5810 7.2187 3.3228 4.6219 19.3869 0.0036 5.7702 10.2440 1.4569 8.3430 12.3221 2.1247 39.1704 13.7987 7.4297 0.0752 36.5048 20.0826 0.1050 14.0695 1.1404 0.8201 0.4848 79.1043 70.4728 165.7727 68.0196 7.7170 6.8305 9.2444 5.7218 30.4137 25.1887 262.1346 6.4983 0.9698 7.1336 11.1978 10.8058 28.6010 0.2861 18.6240 14.1949 3.5306 13.2886 5.5460 33.1547 5.7247 133.3480 66.6082 63.0404 50.9950 55.4133 24.0969 30.3372 9.5738 28.4807 4.9169 7.3405 3.0774
temp: 298.150 k
press: 1.00000 atm
elementType: 8 8 8 7 6 6 6 6 6 6 6 6 6 1 1 1 1 1 1 1 1 1 1 1
symmnumber: 1
zpe: 492979.9 jmol-1
zpe.correction: 0.187766 hartree
zpe.thermalcorrener: 0.200642 hartree
zpe.thermalcorrenthalpy: 0.201586 hartree
zpe.thermalcorrgfe: 0.146228 hartree
zpe.sumelectzpe: -628.975228 hartree
zpe.sumelectthermal: -628.962353 hartree
zpe.sumelectthermalent: -628.961408 hartree
zpe.sumelectthermalfe: -629.016766 hartree
dipole: -2.2296 -0.9994 1.2073
dipole: 2.7253
quadrupole: -80.8476 -74.3378 -75.7915
quadrupole: 3.9268 -8.2336 1.7947
quadrupole: -3.8553 2.6545 1.2008 3.9268 -8.2336 1.7947
hfenergy: -629.1629943 hartree
pointgroup: C01 [X(C9H11N1O3)]
dipole: -0.8715533 0.5969443 -0.1836108 debye
dipolederiv: -1.4467191 0.2099146 0.2743102 0.4071743 -0.5148445 -0.2002641 0.5136079 -0.2012364 -0.5318892 -1.1188711 0.0977026 -0.1849681 0.113942 -0.4375553 0.0079119 -0.2468209 0.0357552 -0.4527324 -0.7726829 -0.2134951 -0.0522566 0.001559 -0.7200452 -0.2365698 0.0948028 -0.2137495 -0.4546308 -0.3378603 -0.0150841 0.0061673 -0.0227245 -0.2537266 -0.0003164 0.0098354 -0.00138 -0.2469386 0.8245188 -0.0788921 -0.1163117 0.0689559 0.2267597 -0.056877 -0.1414403 0.012332 0.2977129 0.7103462 0.0156066 -0.0000254 -0.0044397 0.3809335 0.1148364 -0.0365852 0.0543768 0.1597449 -0.3642565 -0.090048 0.0238017 -0.0917053 0.0337278 0.0491644 0.0404716 0.0430658 0.0331048 1.8283512 0.1295065 -0.2384703 -0.2968912 0.9318159 0.4724342 -0.6129316 0.4469542 0.6150628 -0.1924934 0.1693008 0.1481287 -0.0944502 -0.0256574 0.0403544 -0.031459 -0.0246662 -0.0719559 -0.1143997 -0.1904013 -0.1303787 0.0288089 -0.1258049 -0.0532004 0.0354984 0.0093079 -0.0589428 0.2402966 -0.2048931 -0.230879 -0.0540931 0.0408877 0.0940356 -0.1257949 0.1385094 0.0553327 0.0889602 0.2396219 0.1285198 0.1048079 0.2203497 0.1835281 0.0292147 0.1408565 0.0201758 0.5165756 -0.0737454 0.1602042 -0.1654303 0.3805255 -0.0241348 0.3770157 -0.037058 0.4209129 -0.0077038 0.0301987 0.0180274 -0.0435988 -0.0638085 0.063802 -0.0305115 -0.0037203 0.0888828 0.0041863 0.0066932 0.0360812 0.020326 0.0755906 -0.0796764 0.0396268 -0.0476816 -0.0550502 -0.0167205 0.0040424 0.0122372 0.0123371 0.0155626 -0.0961931 0.0972381 -0.0611737 -0.1100155 -0.0464725 -0.0213176 -0.0040434 -0.0867149 -0.1832291 0.0500116 0.0296127 0.029089 0.0438599 0.1305303 -0.057161 -0.0296516 -0.0246898 0.0436272 -0.0723256 -0.0102926 -0.0627065 0.111055 0.0937411 0.0550402 0.0606866 0.0544721 0.0880176 -0.0560177 0.0574324 -0.0595549 0.0960074 0.0083075 0.0653449 0.0795199 0.053466 0.0397824 -0.0836818 0.0740732 -0.0875426 0.0563959 0.062919 -0.0570955 -0.0218846 -0.0524311 -0.0302142 -0.1048833 -0.0168068 -0.1016251 0.0679856 0.0368014 -0.0566296 -0.0179072 0.0655654 -0.2182318 0.0819015 -0.1005995 0.0541251 0.0239211 -0.1677677 -0.0181588 0.0373964 -0.0318637 0.1022297 0.0249128 0.0573668 0.0280989 0.0641951 0.0404135 0.0539493 0.0416959 0.037618 -0.0066924 -0.1187526 -0.1025543 -0.0903759 -0.1721941 unknown
polarizability: 158.9405477|5.7484268|96.2486245|-9.4721177|21.4198045|81.0577931 unknown
InChI: InChI=1S/C9H11NO3/c1-12-6-7-13-9(11)8-2-4-10-5-3-8/h2-5H,6-7H2,1H3
charge 0 multiplicity 1
24 atoms
O  -0.815329 0.215151 0.860894
O  -4.477355 0.208453 0.289983
O  -0.511777 -1.636833 -0.531082
N  4.105258 0.606001 -0.231759
C  -2.247814 -0.153586 1.036063
C  -3.086662 0.418846 -0.112886
C  1.374625 -0.173441 -0.024994
C  -0.049369 -0.625994 0.050473
C  2.284035 -0.925254 -0.809459
C  1.85056 0.97461 0.655465
C  3.628054 -0.499558 -0.88129
C  3.213941 1.319559 0.52113
C  -5.424441 0.653133 -0.731658
H  -2.34556 -1.250836 1.082465
H  -2.54086 0.305419 1.992008
H  -2.863088 -0.110724 -1.062942
H  -2.872064 1.502397 -0.242841
H  1.936847 -1.815714 -1.341908
H  1.174521 1.573713 1.27007
H  4.361133 -1.054379 -1.476771
H  3.621185 2.199232 1.03149
H  -5.323606 1.740953 -0.932491
H  -6.428612 0.446103 -0.330552
H  -5.284823 0.097651 -1.683008
