program: Gaussian 09
title: 000222925
version: EM64L-G09RevD.01
frameworkgroup: C1[X(C6H4Cl2N4)]
method: RPBEPBE
basis: SDD
operation: Freq
keyword: #p
keyword: freq=noraman
keyword: PBEPBE/SDD
title: #p freq=noraman PBEPBE/SDD
converged: NO NO NO NO
title: Mulliken charges:
elementType: Cl Cl N N N N C C C C C C H H H H
charge: 0.007193 0.045684 -0.161121 -0.036997 0.004023 -0.002716 0.430190 0.192489 -0.210115 -0.610945 -0.349680 -0.347229 0.274203 0.265354 0.234313 0.265354
chargesum: 0.00000
title: Mulliken charges with hydrogens summed into heavy atoms:
elementType: Cl Cl N N N N C C C C C C
charge: 0.007193 0.045684 -0.161121 -0.036997 0.004023 -0.002716 0.430190 0.192489 0.064088 0.154076 -0.349680 -0.347229
polarizability: 1.60355109e+02 -6.97941442e-01 1.23148496e+02 5.25693989e-03 6.20460404e-04 4.65717677e+01
1716.lowfreq: -0.0024 0.0016 0.0022 6.6720 8.4069 11.1925 80.0154 88.4653 104.3784
frequency: 79.9749 88.4639 104.3729 179.8513 190.6362 207.1255 252.4111 297.3514 315.4523 349.7560 447.7043 509.7461 555.2222 571.6055 593.9472 630.7503 630.8890 696.5715 767.5745 848.7296 883.2851 937.2878 1006.2883 1031.2277 1099.2626 1124.0240 1176.6906 1217.3119 1236.1584 1289.6797 1308.0130 1366.5356 1414.8057 1464.6581 1465.3535 1483.3347 1514.3993 1569.0454 3016.0258 3117.7938 3123.5037 3229.9595
redmass: 3.9259 3.5734 1.3866 6.7905 16.1687 7.0648 4.9537 4.1872 20.6801 12.6981 10.4036 7.3825 7.4219 10.1685 11.8420 9.4551 4.8213 6.6914 10.6842 1.4306 10.4673 11.0203 12.0115 2.0521 5.0830 1.3178 3.1483 7.2702 2.9511 3.7202 5.4177 7.8872 2.3368 1.6233 1.0395 1.0872 9.0234 8.5863 1.0330 1.1032 1.1025 1.0991
irintensity: 0.3367 2.7051 0.8900 3.3494 0.4794 0.5033 0.3457 1.9148 0.1797 0.0000 14.6505 21.3226 6.1768 0.5678 0.0015 19.8271 11.0648 5.9346 0.1384 17.6991 28.1630 15.0449 14.9327 15.3478 64.4002 0.6061 4.7246 350.4159 33.2960 4.8911 21.7298 11.1563 20.7038 36.3319 19.9321 26.7981 2.1583 30.8569 23.8242 8.6542 7.2650 0.3019
temp: 298.150 k
press: 1.00000 atm
elementType: 17 17 7 7 7 7 6 6 6 6 6 6 1 1 1 1
symmnumber: 1
zpe: 259546.5 jmol-1
zpe.correction: 0.098856 hartree
zpe.thermalcorrener: 0.109229 hartree
zpe.thermalcorrenthalpy: 0.110173 hartree
zpe.thermalcorrgfe: 0.061749 hartree
zpe.sumelectzpe: -1369.262902 hartree
zpe.sumelectthermal: -1369.252529 hartree
zpe.sumelectthermalent: -1369.251585 hartree
zpe.sumelectthermalfe: -1369.300008 hartree
dipole: 5.6115 5.7106 0.0003
dipole: 8.0063
quadrupole: -80.9362 -86.5127 -81.7944
quadrupole: 9.3142 0.0000 0.0000
quadrupole: 2.1449 -3.4316 1.2867 9.3142 0.0000 0.0000
hfenergy: -1369.3617579 hartree
pointgroup: C01 [X(C6H4Cl2N4)]
dipole: -2.7468687 1.5416445 -0.0001143 debye
dipolederiv: -0.6843264 -0.409196 -0.0000217 -0.3193367 -0.3511983 -0.0000115 0.0000211 0.0000156 -0.0455287 -0.750515 -0.2737548 -0.00005 -0.3594035 -0.1932891 -0.0000246 -0.0000855 -0.0000315 -0.0262905 -0.6856631 0.1048229 -0.0000139 -0.085654 -0.3791379 0.0000003 -0.0000181 -0.000005 -0.1057542 -0.5887697 0.1099403 -0.0000161 0.1711654 -0.4615787 0.0000061 -0.0000057 0.0000055 -0.2271348 -0.3864105 -0.2754149 0.0000124 0.3468305 -0.2026821 -0.0000003 -0.0000089 -0.000015 -0.1787219 -0.2403114 0.1340593 0. -0.5316446 -0.3665592 -0.0000493 0.0000043 0.0000035 -0.1759578 0.1119312 -0.5562331 -0.000011 -0.3122325 -0.1560093 0.0000016 0.0000035 -0.0000146 0.1280611 -0.3595747 0.0336867 -0.0000214 -0.3456459 0.343542 -0.0000116 -0.0000306 -0.000009 0.0854387 0.5928796 0.1293648 0.0000181 0.3356856 0.3107984 0.0000148 0.0000282 -0.0000026 -0.0379962 0.5042219 -0.0448172 0.0000046 0.0232147 0.1150453 -0.0000023 0.0000087 -0.0000042 0.195772 1.0814065 0.6611672 0.0000155 0.3289871 0.6647705 0.000014 -0.0000245 0.0000012 0.0557034 1.2778909 0.3058453 0.0000831 0.7374069 0.5276419 0.0000617 0.0001123 0.0000481 0.060752 0.047666 0.0671546 -0.0000018 0.0434246 0.0738195 0.0000009 -0.0000095 0.0000077 0.1700208 0.012319 0.0020593 -0.0037423 -0.0770184 0.0779448 0.0847042 0.0439537 0.0622047 -0.0152917 0.0549253 0.0092547 -0.000002 0.1212383 -0.0810514 0.0000075 -0.0000014 0.0000021 0.1322143 0.0123304 0.0020609 0.0037466 -0.0770175 0.0779435 -0.0847116 -0.0439475 -0.0622062 -0.0152865 unknown
polarizability: 157.0855744|10.5567784|126.4180308|0.0052213|0.0008707|46.5717677 unknown
InChI: InChI=1S/C6H4Cl2N4/c1-12-2-9-3-4(12)6(8)11-10-5(3)7/h2H,1H3
charge 0 multiplicity 1
16 atoms
Cl -2.060471 -2.425953 -0.000102
Cl 3.477392 0.677146 0.000193
N  -1.559429 0.977216 -0.00009
N  0.466647 2.076409 -0.000036
N  0.618044 -2.12207 -0.000002
N  1.837088 -1.453246 0.000074
C  -0.573865 -0.015182 -0.000095
C  0.678124 0.690741 -0.00002
C  -0.87149 2.198666 -0.000052
C  -3.025057 0.813779 -0.000121
C  -0.536588 -1.425806 -0.000123
C  1.853017 -0.099077 0.000025
H  -1.404054 3.148474 -0.000064
H  -3.355033 0.265491 0.896165
H  -3.485834 1.814353 -0.000148
H  -3.354991 0.265462 -0.896404
