program: Gaussian 09
title: 000222924
version: EM64L-G09RevD.01
frameworkgroup: C1[X(C6H6N4O2)]
method: RPBEPBE
basis: SDD
operation: Freq
keyword: #pfreq=noraman
keyword: PBEPBE/SDD
title: #p freq=noraman PBEPBE/SDD
converged: NO NO NO NO
title: Mulliken charges:
elementType: O O N N N N C C C C C C H H H H H H
charge: -0.288948 -0.244006 -0.150977 -0.323256 -0.043329 -0.342668 0.182120 -0.038423 0.184918 0.186816 -0.224043 -0.601413 0.269394 0.339396 0.265549 0.265538 0.224576 0.338756
chargesum: 0.00000
title: Mulliken charges with hydrogens summed into heavy atoms:
elementType: O O N N N N C C C C C C
charge: -0.288948 -0.244006 -0.150977 0.016140 -0.043329 -0.003912 0.182120 -0.038423 0.184918 0.186816 0.045350 0.154250
polarizability: 1.29609256e+02 -3.88477395e+00 1.15413447e+02 4.22417751e-03 -1.36360670e-04 4.41486375e+01
1716.lowfreq: -58.5294 -9.3880 -0.0007 -0.0006 0.0007 2.3545 14.2287 93.8943 109.0946
frequency: -58.1644 93.8847 109.0734 181.6100 203.8188 207.5739 253.3946 329.2688 350.3376 361.7954 455.0769 477.0212 545.6617 585.9476 605.3560 621.4969 630.7158 692.0421 696.7234 759.3457 783.4977 818.5593 987.8782 1040.6993 1042.6374 1120.0144 1124.1947 1182.8443 1245.8987 1295.0424 1318.1480 1353.7917 1368.4105 1369.4368 1428.5517 1456.1897 1458.4237 1468.7028 1485.0850 1504.4107 1629.2032 1673.2071 3017.4396 3117.2957 3126.0010 3235.1926 3540.8528 3551.0700
redmass: 1.0682 3.5865 11.2807 4.4281 6.9305 4.3024 3.6169 10.2627 1.3323 5.0839 10.2166 7.0535 1.1865 6.9303 7.4916 4.7641 4.0497 6.3933 8.8926 9.5992 8.5094 1.4684 6.6236 3.9120 2.0533 3.2030 1.3288 2.3243 2.5536 5.4724 5.2021 3.7080 4.2235 1.7941 1.6198 1.9374 1.0388 2.6451 1.4608 2.5073 6.1301 7.8164 1.0331 1.1022 1.1032 1.0990 1.0797 1.0796
irintensity: 0.2357 5.7506 8.1665 2.2647 3.9116 5.2862 0.7353 10.9017 0.0324 5.4754 2.0659 1.9581 221.1316 5.8947 2.5036 0.1317 58.2848 5.3570 21.2115 1.5842 1.5717 21.0158 8.6624 128.6621 10.8081 37.7737 0.9636 54.8699 8.7964 33.0993 6.4682 19.8704 38.1507 2.9154 2.3496 6.3932 17.0592 54.3481 6.1877 13.4069 641.0381 102.5189 23.7799 8.5863 10.1763 0.6203 10.0042 136.1489
temp: 298.150 k
press: 1.00000 atm
elementType: 8 8 7 7 7 7 6 6 6 6 6 6 1 1 1 1 1 1
symmnumber: 1
zpe: 334373.1 jmol-1
zpe.correction: 0.127356 hartree
zpe.thermalcorrener: 0.136976 hartree
zpe.thermalcorrenthalpy: 0.137920 hartree
zpe.thermalcorrgfe: 0.092339 hartree
zpe.sumelectzpe: -600.816559 hartree
zpe.sumelectthermal: -600.806939 hartree
zpe.sumelectthermalent: -600.805995 hartree
zpe.sumelectthermalfe: -600.851576 hartree
dipole: -3.0635 3.1421 0.0002
dipole: 4.3884
quadrupole: -61.3315 -75.9673 -69.2708
quadrupole: 25.1095 -0.0002 0.0012
quadrupole: 7.5250 -7.1108 -0.4143 25.1095 -0.0002 0.0012
hfenergy: -600.9439149 hartree
pointgroup: C01 [X(C6H6N4O2)]
dipole: -1.2517104 1.1891468 0.0006003 debye
dipolederiv: -0.9809876 0.3503741 0.000118 0.4383348 -0.9319123 -0.0001427 0.0002203 -0.0001763 -0.3638876 -1.121211 0.4523965 0.000273 0.3532841 -0.7246963 -0.0001704 -0.0000303 0.0000199 -0.3504662 -0.6456794 0.1433635 0.0001545 0.0846421 -0.1142187 0.0000131 0.0001949 -0.0000473 -0.0916548 -0.4635322 0.2190374 -0.0001317 -0.4953941 -0.4542333 -0.0001106 -0.0005883 -0.0005169 -0.3051893 -0.4625519 -0.1548842 0.000045 -0.015858 -0.3998079 -0.0000587 0.0000717 -0.0000118 -0.2334825 -0.4142349 -0.3783786 0.0000556 0.3457454 -0.4842734 0.0002253 0.0005221 0.0004673 -0.3379503 0.3969767 0.0879103 -0.0000952 0.1220489 -0.6695925 -0.0002128 0.0000191 -0.0001622 0.0343151 -0.4173133 0.0504554 0.0000779 0.1107448 0.3370237 0.0000488 0.0001118 0.0001128 0.0006468 1.4836964 -0.3726477 -0.0001156 -0.1908691 1.2264222 0.0002276 -0.0001968 0.0002571 0.2489589 1.4021026 -0.3409404 -0.000333 -0.5528363 1.3030951 0.0002102 -0.0002024 0.0001016 0.2540207 0.3267825 -0.0281745 -0.0000681 -0.2218238 0.2074231 0.0001436 -0.0001537 0.0000512 -0.0642942 0.4487987 -0.0377628 -0.0000731 -0.0478429 0.1579284 -0.0000326 -0.0000981 -0.0000477 0.1849414 0.0184966 -0.0608158 0.0000121 -0.0400478 0.0881703 -0.0000196 0.0000472 0.0000395 0.1821778 0.1436701 0.0582508 0.0000994 0.0580962 0.2233458 -0.0000174 0.0002516 0.0001551 0.3728631 0.0371377 0.0047614 -0.018824 0.0723889 0.0618845 -0.0793377 0.0277815 -0.0709301 -0.0157687 0.0370589 0.0048328 0.0187398 0.0724743 0.0618528 0.0793023 -0.0278635 0.0709569 -0.0157905 -0.0009959 -0.0387788 0.000057 -0.1561535 -0.0481708 0.000068 0.0000346 0.0000104 0.1263203 0.211786 0.0410004 0.0000082 0.0630658 0.1597591 -0.0001365 -0.0001217 -0.0002794 0.37424 unknown
polarizability: 129.8856586|-3.3303548|115.137039|-0.015193|0.0157912|44.1486432 unknown
InChI: InChI=1S/C6H6N4O2/c1-10-2-7-3-4(10)6(12)9-8-5(3)11/h2,8-9H,1H3
charge 0 multiplicity 1
18 atoms
O  -1.326736 2.436784 0.000938
O  2.992477 -1.083931 -0.000428
N  -1.695746 -0.646188 0.000484
N  0.955058 1.941311 0.000579
N  0.052018 -2.120138 -0.00023
N  2.042845 1.034454 -0.000052
C  -0.528425 0.113982 0.000364
C  0.538069 -0.813792 -0.000145
C  -0.396334 1.56995 0.000582
C  1.946374 -0.382608 -0.000434
C  -1.291215 -1.982134 -0.000059
C  -3.077947 -0.139178 0.001115
H  -2.004153 -2.804236 -0.000135
H  1.18254 2.938643 0.000429
H  -3.259079 0.482754 0.891565
H  -3.259904 0.482751 -0.889172
H  -3.76878 -0.997169 0.001427
H  2.979639 1.445443 0.000373
