program: Gaussian 09
title: 000222902
version: EM64L-G09RevD.01
frameworkgroup: C1[X(C5H5N3O)]
method: RPBEPBE
basis: SDD
operation: Freq
keyword: #pfreq=noraman
keyword: PBEPBE/SDD
title: #p freq=noraman PBEPBE/SDD
converged: YES YES NO NO
title: Mulliken charges:
elementType: O N N N C C C C C H H H H H
charge: -0.264941 -0.133129 -0.051050 -0.612123 0.046284 -0.216674 -0.169142 0.188661 -0.295631 0.294004 0.250924 0.257958 0.368935 0.335925
chargesum: 0.00000
title: Mulliken charges with hydrogens summed into heavy atoms:
elementType: O N N N C C C C C
charge: -0.264941 -0.133129 -0.051050 0.092737 0.046284 0.077331 0.081782 0.188661 -0.037673
polarizability: 1.03045643e+02 1.71900637e+00 8.22031861e+01 1.28429380e-03 -9.17945112e-04 3.18561015e+01
1716.lowfreq: -11.6950 -0.0012 -0.0011 -0.0010 1.9938 11.7069 91.6303 149.9650 203.2831
frequency: 91.6243 149.9622 203.2804 356.6574 363.3643 398.1898 477.3750 591.3090 593.8245 621.0488 705.4114 708.1570 759.1632 759.3901 836.4880 950.7523 985.8432 1005.0339 1012.0404 1056.2913 1069.9688 1130.1494 1159.8353 1204.5000 1345.5754 1356.6481 1414.9211 1524.5639 1557.3444 1563.3714 1642.6287 3153.9415 3168.6939 3182.9470 3472.0428 3660.1444
redmass: 6.4803 4.6427 4.9076 3.9311 5.2054 3.8804 5.2083 4.3463 1.2659 8.1329 1.0865 5.2199 2.1248 6.0472 1.9690 1.3932 6.3847 4.0310 1.3645 2.2655 2.0951 2.0459 2.4029 2.0055 2.3698 2.7793 2.3190 5.3004 1.3599 5.3691 6.0727 1.0881 1.0933 1.1015 1.0484 1.1011
irintensity: 18.0152 2.1596 30.5438 0.0110 0.5909 1.3353 1.1697 10.5156 129.7906 0.1206 135.5367 63.9594 25.4018 1.2099 18.7304 0.5384 3.2199 0.2122 0.9360 9.3095 2.8898 5.9123 11.0111 10.0830 64.9244 62.4313 14.2310 2.1438 156.7388 15.3812 278.2073 1.8926 3.8572 11.7502 54.2512 77.3037
temp: 298.150 k
press: 1.00000 atm
elementType: 8 7 7 7 6 6 6 6 6 1 1 1 1 1
symmnumber: 1
zpe: 264569.0 jmol-1
zpe.correction: 0.100769 hartree
zpe.thermalcorrener: 0.108063 hartree
zpe.thermalcorrenthalpy: 0.109007 hartree
zpe.thermalcorrgfe: 0.068756 hartree
zpe.sumelectzpe: -432.343089 hartree
zpe.sumelectthermal: -432.335795 hartree
zpe.sumelectthermalent: -432.334851 hartree
zpe.sumelectthermalfe: -432.375101 hartree
dipole: 1.7757 0.5841 0.0103
dipole: 1.8693
quadrupole: -44.6755 -54.0525 -53.3082
quadrupole: 15.8231 -0.0125 -0.0068
quadrupole: 6.0032 -3.3738 -2.6295 15.8231 -0.0125 -0.0068
hfenergy: -432.4438575 hartree
pointgroup: C01 [X(C5H5N3O1)]
dipole: -0.6913709 -0.2507193 0.0040622 debye
dipolederiv: -0.7763625 0.2607015 0.0001012 0.0554145 -0.8629611 -0.0003986 -0.0001495 -0.0003255 -0.3692366 -0.1775045 -0.1423946 0.0001513 0.1218257 -0.1466632 -0.0000606 -0.0005398 -0.000176 -0.2086702 -0.3037713 0.1441558 -0.0002072 -0.2259135 -0.0331805 -0.0003568 0.0002017 -0.0002454 -0.2369885 -0.6411401 -0.4197136 -0.0004738 -0.2611594 -0.9633574 0.0000054 -0.0003611 0.0003082 -0.6633008 -0.0129452 0.0006961 0.0000602 0.1206597 -0.0773319 0.0001453 0.0000973 0.0002005 0.1416371 -0.1511544 -0.0786308 0.0000899 -0.1202868 0.0584935 -0.0002055 0.0000789 -0.0001145 -0.0343792 -0.0149402 0.1194544 -0.0001424 0.1700444 0.08494 -0.0001336 -0.0001043 -0.000167 -0.0732779 1.1773108 0.1022492 0.0001381 0.1636468 1.3945129 0.0008589 0.0004772 0.0006384 0.2180499 0.2488751 -0.0686408 0.0000836 -0.0207743 -0.0548814 0.0000841 0.0000574 0.0000705 0.0221864 0.1382518 0.0699402 -0.0001159 0.0392886 0.0513021 0.0001679 -0.0001414 0.0001262 0.1481013 0.0387467 -0.0792401 0.0000816 -0.0990589 -0.0101344 0.0001748 0.0001397 0.0001707 0.1431269 -0.0739547 -0.0011484 -0.0000373 -0.0053191 0.103259 0.0000568 -0.000111 0.0000736 0.1486345 0.3584517 0.0475336 0.0002594 0.0402521 0.2497543 -0.0001674 0.0004421 -0.0003047 0.3732359 0.1901367 0.0450375 0.0000112 0.0213801 0.2062479 -0.0001706 -0.0000872 -0.0002551 0.3908813 unknown
polarizability: 102.9234308|2.3424852|82.3253786|0.0126572|-0.0295503|31.8561216 unknown
InChI: InChI=1S/C5H5N3O/c6-5(9)4-2-1-3-7-8-4/h1-3H,6H2
charge 0 multiplicity 1
14 atoms
O  2.434743 -1.174478 -0.000062
N  -0.318557 1.178665 -0.001464
N  -1.688366 1.278332 -0.001871
N  2.360391 1.170935 0.001238
C  0.277038 -0.058387 0.000404
C  -0.44966 -1.272814 0.001639
C  -1.851127 -1.17892 0.001279
C  1.794239 -0.078896 0.00057
C  -2.423151 0.117902 -0.000396
H  0.098355 -2.219144 0.002992
H  -2.488311 -2.067932 0.002258
H  -3.506492 0.272347 -0.000836
H  1.736853 1.983667 0.00267
H  3.373842 1.267522 0.001376
