program: Gaussian 09
title: 000018869
version: EM64L-G09RevD.01
frameworkgroup: C1[X(C10H14N2O)]
method: RPBEPBE
basis: SDD
operation: Freq
keyword: #p
keyword: freq=noraman
keyword: PBEPBE/SDD
title: #p freq=noraman PBEPBE/SDD
converged: YES YES NO NO
title: Mulliken charges:
elementType: O N N C C C C C C C C C C H H H H H H H H H H H H H H
charge: -0.238778 -0.250883 -0.420758 -0.047394 -0.649299 -0.705097 0.271372 0.185870 -0.361222 -0.371087 -0.219429 -0.231175 -0.228124 0.180227 0.278536 0.199611 0.239808 0.221971 0.204110 0.218416 0.238594 0.288011 0.272082 0.232635 0.231678 0.228603 0.231719
chargesum: 0.00000
title: Mulliken charges with hydrogens summed into heavy atoms:
elementType: O N N C C C C C C C C C C
charge: -0.238778 0.027653 -0.132747 0.132834 0.012092 -0.043977 0.271372 0.185870 -0.089140 -0.138452 0.012249 -0.002572 0.003596
polarizability: 1.75204561e+02 -1.34693477e+00 1.22247729e+02 -1.42317406e+01 -1.52583836e+00 7.86885907e+01
1716.lowfreq: -2.2586 0.0006 0.0007 0.0007 5.2036 13.8163 41.2459 42.4708 49.6252
frequency: 41.1680 42.4422 49.5800 82.0333 137.1637 165.7124 197.8821 239.7048 257.5159 289.8607 318.0102 367.4271 403.4722 404.6189 419.4996 459.6860 505.6074 583.5206 598.9313 615.9812 679.1240 694.9182 707.9419 790.4969 826.2504 857.7684 863.4008 919.3814 933.4584 941.1542 960.2379 983.6059 989.5237 1003.9782 1015.9683 1042.9663 1083.7807 1114.5425 1165.7900 1173.2996 1184.7459 1187.3720 1204.0366 1256.2510 1314.5842 1315.3851 1332.3524 1378.2138 1382.8910 1392.7308 1428.4842 1436.8874 1459.1382 1467.0477 1474.2015 1477.4787 1488.8086 1513.7322 1583.6055 1609.4045 1626.7700 2840.0202 2978.5547 2989.4100 3071.3108 3083.9765 3096.7957 3102.7528 3122.0804 3131.7964 3144.4144 3156.9278 3168.6501 3390.5260 3436.2859
redmass: 3.1887 3.9254 3.3282 5.0413 3.6618 4.0132 1.0949 1.0981 3.3391 4.6442 4.2544 2.7044 3.9319 3.0539 1.5537 3.1737 2.7892 1.3710 2.9444 5.1331 5.7272 4.0082 1.5634 2.3318 2.4978 1.4638 3.6387 1.2196 1.4736 1.6105 1.6411 1.4521 4.9885 1.3389 3.5547 2.3791 1.6153 1.9298 2.0183 1.0603 1.5362 1.4879 3.3591 2.7848 1.3541 1.4364 1.3032 1.2353 9.2657 1.2117 1.5856 1.5446 1.0779 1.0483 1.3493 1.4830 1.0762 1.4808 6.1924 6.0640 8.0909 1.0819 1.0373 1.0357 1.0973 1.0992 1.1003 1.1002 1.0858 1.0877 1.0924 1.0959 1.1007 1.0760 1.0761
irintensity: 0.4900 1.0415 1.5220 2.9232 5.2813 2.3893 0.4370 0.7416 2.4169 2.7873 0.1905 2.0613 6.7667 0.7977 66.2603 2.0044 23.2451 87.0467 26.9411 8.2829 4.6920 4.3730 106.2009 24.4513 4.6969 1.6331 18.8960 5.1050 5.0785 0.1233 0.4944 1.5708 0.0080 0.6769 29.6783 10.9937 12.0696 21.9396 3.6455 0.9598 3.9716 19.2444 44.2326 124.2529 1.4872 1.5352 22.5103 21.0456 0.6985 20.0287 8.4081 18.0097 20.9529 4.2008 16.6326 10.5639 25.4782 64.6877 23.2174 5.5714 135.0238 96.9224 37.1681 18.2049 32.1595 43.0843 14.1433 41.4638 6.0358 3.8241 24.5185 18.6618 19.7041 40.0586 0.9173
temp: 298.150 k
press: 1.00000 atm
elementType: 8 7 7 6 6 6 6 6 6 6 6 6 6 1 1 1 1 1 1 1 1 1 1 1 1 1 1
symmnumber: 1
zpe: 587097.4 jmol-1
zpe.correction: 0.223614 hartree
zpe.thermalcorrener: 0.236864 hartree
zpe.thermalcorrenthalpy: 0.237808 hartree
zpe.thermalcorrgfe: 0.182833 hartree
zpe.sumelectzpe: -573.189447 hartree
zpe.sumelectthermal: -573.176197 hartree
zpe.sumelectthermalent: -573.175253 hartree
zpe.sumelectthermalfe: -573.230227 hartree
dipole: -0.0084 -3.9912 2.4349
dipole: 4.6753
quadrupole: -63.0311 -74.2282 -83.1456
quadrupole: -4.5139 -0.7490 5.1045
quadrupole: 10.4372 -0.7599 -9.6773 -4.5139 -0.7490 5.1045
hfenergy: -573.4130607 hartree
pointgroup: C01 [X(C10H14N2O1)]
dipole: 0.0018176 1.7684309 -0.5059871 debye
polarizability: 175.5945069|-2.7426347|119.990162|12.6309278|9.7957004|80.5562109 unknown
InChI: InChI=1S/C10H14N2O/c1-8(2)11-12-10(13)9-6-4-3-5-7-9/h3-8,11-12H,1-2H3
charge 0 multiplicity 1
27 atoms
O  0.479139 -1.725562 0.720678
N  2.460135 0.3277 0.665964
N  1.087071 0.529199 0.427396
C  3.357683 0.508794 -0.507526
C  3.080108 -0.580868 -1.560466
C  4.809032 0.454593 0.008631
C  -1.260263 -0.111949 0.186995
C  0.166025 -0.527969 0.474518
C  -2.13204 -1.094749 -0.347591
C  -1.765161 1.186507 0.463304
C  -3.477044 -0.778522 -0.630365
C  -3.114682 1.500467 0.185419
C  -3.971251 0.522089 -0.369491
H  3.189417 1.510341 -0.983273
H  2.77407 0.816177 1.514976
H  3.735684 -0.442381 -2.4397
H  3.257655 -1.578085 -1.122872
H  2.031175 -0.546094 -1.904343
H  5.013461 1.256486 0.744653
H  5.517408 0.577429 -0.828811
H  5.001478 -0.51993 0.491486
H  0.773567 1.426046 0.029632
H  -1.734069 -2.100023 -0.521128
H  -1.12787 1.94313 0.936457
H  -4.141217 -1.542895 -1.048512
H  -3.499669 2.500779 0.412682
H  -5.017441 0.766591 -0.584812
