program: Gaussian 09
title: 000222874
version: EM64L-G09RevD.01
frameworkgroup: C1[X(C10H8ClNO2S)]
method: RPBEPBE
basis: SDD
operation: Freq
keyword: #p
keyword: freq=noraman
keyword: PBEPBE/SDD
title: #p freq=noraman PBEPBE/SDD
converged: YES YES NO NO
title: Mulliken charges:
elementType: Cl S O O N C C C C C C C C C C H H H H H H H H
charge: -0.025857 0.927611 -0.531439 -0.528719 -0.705407 0.464582 -0.277804 0.519524 -0.271790 -0.350502 -0.364312 -0.389258 -0.246795 -0.252452 -0.227738 0.306125 0.277944 0.264420 0.271119 0.238469 0.238104 0.324228 0.339947
chargesum: 0.00000
title: Mulliken charges with hydrogens summed into heavy atoms:
elementType: Cl S O O N C C C C C C C C C C
charge: -0.025857 0.927611 -0.531439 -0.528719 -0.041232 0.464582 -0.277804 0.519524 0.034335 -0.072557 -0.364312 -0.124838 0.024325 -0.013984 0.010366
polarizability: 2.03172466e+02 -1.87512850e+00 1.91804624e+02 -1.30468926e-01 -1.27474633e-01 7.91638627e+01
1716.lowfreq: -10.6529 0.0009 0.0016 0.0032 1.0818 6.9025 42.5828 67.7518 117.0299
frequency: 42.5680 67.7505 117.0298 128.4069 141.2918 178.3203 197.4210 215.3195 222.2077 238.0011 285.3997 315.0696 357.4930 377.6109 408.8622 428.8811 464.8987 472.9997 490.4427 524.6732 551.1322 584.7824 632.1361 657.0081 778.0433 780.4452 793.2193 798.4075 804.5179 844.5397 845.4410 893.2780 915.1706 942.7626 965.5913 972.5932 1002.1970 1034.2512 1063.2261 1115.1770 1131.1391 1174.3746 1185.2111 1207.7742 1277.4062 1356.8343 1365.2111 1404.9995 1426.1364 1439.6886 1500.8219 1537.4367 1566.6488 1591.7940 1629.0360 3140.6868 3152.2661 3155.5191 3170.4093 3179.2341 3181.0368 3360.5149 3526.5765
redmass: 7.6465 6.5310 4.4727 3.2064 3.0535 3.5237 11.5754 7.3484 2.5540 8.0642 4.0700 6.3598 6.4744 10.7584 3.2667 8.8000 3.8040 3.9198 4.8891 7.0985 8.0860 3.5740 3.6122 6.4646 1.8492 2.9393 2.1523 2.6950 3.5582 2.0288 2.2418 1.8857 4.8363 7.0148 1.3593 1.3736 1.3493 2.3947 1.4162 1.9748 2.1657 1.4796 1.2209 1.8163 1.5475 2.3882 2.6284 6.9195 3.0257 2.3659 3.3857 1.0890 7.8502 6.3905 6.7396 1.0864 1.0905 1.0901 1.0956 1.0993 1.0954 1.0416 1.0998
irintensity: 1.7594 2.1038 0.0735 13.9481 10.5936 2.0435 3.6843 0.2882 19.0569 0.9239 5.6107 9.1856 2.2787 58.3864 3.5280 38.3562 54.9663 26.5680 63.2065 7.3733 3.2450 1.0678 0.8168 18.2685 47.1981 36.8658 123.1193 1.6955 56.7340 70.8233 58.4142 2.7829 92.8039 31.1296 0.5948 1.5729 0.1932 8.8893 24.2092 5.0234 4.8213 1.9270 4.6626 35.0093 20.1524 24.0637 18.0990 6.0045 10.1227 2.1532 40.6128 29.4611 14.6469 8.1840 4.0918 5.4743 9.1541 7.2566 3.8688 14.8200 3.6481 25.4528 22.0693
temp: 298.150 k
press: 1.00000 atm
elementType: 17 16 8 8 7 6 6 6 6 6 6 6 6 6 6 1 1 1 1 1 1 1 1
symmnumber: 1
zpe: 414561.8 jmol-1
zpe.correction: 0.157898 hartree
zpe.thermalcorrener: 0.171863 hartree
zpe.thermalcorrenthalpy: 0.172807 hartree
zpe.thermalcorrgfe: 0.116861 hartree
zpe.sumelectzpe: -1447.946555 hartree
zpe.sumelectthermal: -1447.932590 hartree
zpe.sumelectthermalent: -1447.931646 hartree
zpe.sumelectthermalfe: -1447.987592 hartree
dipole: -2.0285 1.3068 3.1899
dipole: 3.9997
quadrupole: -105.9390 -92.3752 -104.8071
quadrupole: 1.0760 13.4767 -0.5824
quadrupole: -4.8986 8.6652 -3.7666 1.0760 13.4767 -0.5824
hfenergy: -1448.1044528 hartree
pointgroup: C01 [X(C10H8Cl1N1O2S1)]
dipole: 0.8890325 0.2916273 -1.2652449 debye
dipolederiv: -0.7403428 0.3517776 -0.017063 0.2582802 -0.2415288 0.009951 0.0015933 0.0036011 -0.0499046 2.1133089 -0.0772801 0.1598088 -0.1716506 1.1663442 -0.0923719 0.2120317 -0.0888721 1.5675605 -0.8101796 -0.1003419 0.0323887 -0.081075 -0.6221727 0.1446145 -0.0516902 -0.004347 -0.530439 -0.7529057 0.0586119 -0.0139854 0.0935703 -0.5514739 -0.1431978 -0.0010306 -0.0137105 -0.5469208 -0.6909592 0.0023771 -0.0723805 0.0785127 -0.4215823 0.1488175 -0.1224935 0.1869372 -0.7939754 -0.2140596 -0.1350303 0.0014221 0.474112 0.1126331 0.0094194 0.0056558 0.0053201 0.0630447 -0.0800496 0.0431699 0.0084543 0.0178014 -0.1286206 -0.023867 0.0448977 -0.0336005 -0.2019847 -0.2200098 0.351547 -0.0158314 0.0587288 -0.1555309 0.005325 -0.0216565 0.0072545 0.0720376 -0.063566 0.0414442 -0.014041 -0.3410908 -0.0617365 -0.0081664 0.0253456 -0.0232583 -0.0913736 0.0183932 -0.0665523 0.0107901 -0.1105953 -0.1155667 -0.0090026 -0.0158586 0.0079636 -0.100105 1.1459116 -0.5595598 0.0158004 -0.2931829 0.4615806 -0.0257593 -0.0027961 -0.0204165 -0.0717045 -0.020953 0.0024519 -0.0083464 -0.0770104 -0.0722241 -0.0016498 0.0070101 -0.0065312 -0.1486085 -0.4547624 0.0068939 0.00024 -0.012983 -0.0401594 -0.0010862 -0.008972 -0.0009824 -0.1019771 -0.0001442 -0.0798739 -0.0006353 -0.0935993 0.1728778 -0.0089553 0.0059648 -0.0060727 -0.1344911 0.1147847 0.1057909 -0.0133233 0.1454609 -0.0281126 -0.0090452 -0.0140004 -0.0085495 -0.1356129 0.1212972 -0.049546 0.0124195 -0.0224243 0.1221222 -0.0000172 0.0078353 0.0034465 0.1576181 0.0575541 0.0639087 0.0023343 0.0267334 0.0976816 0.0097912 -0.0075824 -0.0088661 0.1328827 -0.0162865 0.010563 0.0024914 0.0579099 0.0870442 0.0023058 0.0006431 0.0052022 0.1617712 0.0584845 0.0339481 -0.0017836 0.0381112 -0.0102939 0.0115623 -0.0007659 0.0094571 0.1699439 0.0837194 0.0344743 0.0007704 0.0194406 -0.0994785 0.0108731 0.0002822 0.0096419 0.1545741 -0.0309388 -0.1043194 0.0087043 -0.1002908 0.0043756 0.0100771 0.0093898 0.0100319 0.1563241 0.24098 -0.0097917 -0.098188 -0.0082973 0.0804749 0.0220902 -0.0343753 -0.0155478 0.1571101 0.1407237 0.075337 -0.0000465 0.0435383 0.2433467 -0.0617082 -0.0394278 -0.0181015 0.1142303 unknown
polarizability: 203.4589918|-0.1421903|191.1344941|1.1892242|-6.4597258|79.5474671 unknown
InChI: InChI=1S/C10H8ClNO2S/c11-9-5-6-10(15(12,13)14)8-4-2-1-3-7(8)9/h1-6H,12H2
charge 0 multiplicity 1
23 atoms
Cl 3.432891 -2.189946 0.088622
S  -2.696492 -0.066497 0.075027
O  -3.55124 -1.440826 0.268662
O  -2.975829 1.2274 1.020987
N  -2.894049 0.593867 -1.631874
C  0.179252 0.409656 0.003442
C  -0.86621 -0.566656 0.070354
C  1.548336 -0.095554 0.005046
C  -0.65189 -1.936384 0.1515
C  -0.03659 1.825365 -0.060366
C  1.738964 -1.516646 0.082313
C  2.631818 0.837145 -0.071336
C  0.687342 -2.424761 0.159512
C  1.045959 2.703058 -0.132947
C  2.386501 2.208685 -0.140882
H  -1.502822 -2.621978 0.219252
H  -1.058718 2.21142 -0.033348
H  3.656138 0.453401 -0.072517
H  0.881509 -3.498118 0.224231
H  0.867001 3.782279 -0.178472
H  3.224033 2.911676 -0.198188
H  -3.094724 -0.181003 -2.286118
H  -3.646579 1.303018 -1.603899
