program: Gaussian 09
title: 000222915
version: EM64L-G09RevD.01
frameworkgroup: C1[X(C16H23NO3)]
method: RPBEPBE
basis: SDD
operation: Freq
keyword: #p
keyword: freq=noraman
keyword: PBEPBE/SDD
title: #p freq=noraman PBEPBE/SDD
converged: YES YES NO NO
title: Mulliken charges:
elementType: O O O N C C C C C C C C C C C C C C C C H H H H H H H H H H H H H H H H H H H H H H H
charge: -0.296401 -0.426895 -0.301414 -0.378479 -0.370955 -0.371487 -0.370954 -0.376392 -0.352309 -0.413448 -0.356044 -0.696214 0.141420 0.125600 0.149989 -0.328818 -0.308797 -0.225028 -0.227923 0.136750 0.187729 0.194293 0.183677 0.208346 0.187734 0.187198 0.236798 0.197261 0.187411 0.188580 0.206646 0.247860 0.194185 0.193595 0.371719 0.210125 0.209948 0.214219 0.292683 0.277163 0.239830 0.239942 0.390856
chargesum: 0.00000
title: Mulliken charges with hydrogens summed into heavy atoms:
elementType: O O O N C C C C C C C C C C C C C C C C
charge: -0.296401 -0.036039 -0.301414 -0.006760 0.011067 0.020537 0.003978 0.057667 0.023682 0.041058 0.031736 -0.061921 0.141420 0.125600 0.149989 -0.036135 -0.031634 0.014803 0.012018 0.136750
polarizability: 2.37357747e+02 9.93837255e+00 1.99758216e+02 3.83792416e+01 -7.52877240e+00 1.44943028e+02
1716.lowfreq: -17.7393 -4.8917 -4.0205 0.0008 0.0010 0.0010 8.3280 12.0715 31.8707
frequency: 4.7522 10.4563 31.6811 42.9557 45.0803 57.9383 65.6986 88.5964 99.5319 110.5373 137.2065 145.8187 147.0327 191.1302 215.4890 228.7372 236.0659 254.2568 296.1973 314.3258 335.4090 382.3056 394.6130 419.3919 446.6494 454.7376 469.4658 526.8009 549.6512 601.4217 613.9753 641.6079 679.4284 703.0300 720.2407 726.8757 746.8826 753.7430 781.1220 790.2939 795.8284 811.1970 839.1403 882.8474 886.6926 906.8274 914.1062 940.4668 989.7494 1000.4596 1001.5630 1012.5799 1013.1260 1025.4523 1046.4983 1061.3967 1069.1783 1073.5978 1081.0278 1100.5419 1120.0411 1137.8104 1153.9696 1160.1561 1181.0479 1189.9235 1215.5862 1230.5236 1256.5553 1266.4864 1272.3420 1273.9109 1278.3880 1287.9342 1291.5269 1294.4315 1317.0517 1320.6049 1340.9294 1348.6250 1351.2074 1362.5405 1373.5855 1387.8457 1416.4975 1447.6155 1458.1395 1461.1585 1463.0209 1468.0775 1468.6837 1476.0288 1476.2218 1483.3200 1488.2981 1554.8401 1561.0258 1577.9642 1607.1150 1622.6992 2948.9986 2949.8526 2952.9867 2959.3207 2966.7595 2971.6855 2974.5949 2983.8994 2992.8106 2999.0956 3004.8130 3020.5750 3035.5325 3048.3781 3068.2094 3070.7753 3071.7679 3138.7193 3156.7946 3170.1121 3186.4362 3311.6377 3523.4215
redmass: 5.6649 4.3705 1.8022 3.7466 6.5304 4.3150 5.2751 1.6988 4.3033 2.8448 2.0028 2.9352 3.5204 3.6786 3.0632 1.1191 5.2459 6.7537 4.2668 4.7658 2.8412 4.3430 6.2910 3.6665 3.8030 3.0013 4.8737 2.6477 5.0752 1.2972 4.5983 5.4485 4.1982 3.1839 1.0669 1.1090 3.6986 1.2383 4.0258 2.3143 1.8047 1.3091 1.2354 1.6705 1.8359 2.4530 1.4348 1.5003 1.3895 1.4407 2.6164 1.3713 5.1048 4.0410 2.6980 2.6336 2.3130 2.1393 2.2462 2.6408 2.3493 2.0652 1.9226 2.1230 1.0729 1.6850 1.3055 1.3832 1.3106 1.3689 1.4735 2.3977 1.0355 1.2227 1.1066 1.1450 1.6331 1.8506 1.4321 1.4667 1.6744 1.4092 10.3298 1.2170 2.0042 1.1311 1.0800 1.0713 1.0710 2.4005 1.0817 1.0433 1.0778 1.0861 1.0902 2.1593 3.6514 6.9684 6.0657 4.2355 1.0590 1.0590 1.0599 1.0597 1.0591 1.0362 1.0630 1.0961 1.0973 1.0639 1.0989 1.1027 1.1036 1.1014 1.1007 1.0993 1.1034 1.0868 1.0918 1.0959 1.0963 1.0847 1.0641
irintensity: 0.2638 0.0466 0.1043 2.5690 1.8997 1.5669 0.2825 0.0817 2.0362 0.5931 0.1182 0.2166 1.7051 3.2893 2.0078 0.0016 2.2153 0.5282 1.4896 6.5665 7.9836 1.7307 9.1691 6.9922 6.3736 0.1894 1.6101 1.8668 11.8558 104.1105 43.9138 5.1243 0.6528 97.8147 16.3495 0.7244 21.2424 7.7999 0.2576 38.6467 20.5990 25.5598 89.4618 10.9238 5.3277 14.3413 0.5005 1.1990 9.6094 0.6429 2.8181 2.0331 183.3503 12.1449 3.9303 6.1475 11.6893 11.0571 14.9012 51.1069 2.4528 4.3812 101.0298 6.6967 4.0257 0.7464 4.8582 1.3048 1.4477 9.2679 5.7393 46.3759 2.0588 4.8772 0.1135 11.2638 41.3469 39.2209 2.2352 1.1644 0.5427 14.4323 25.3214 11.1211 0.2878 24.7726 2.4963 0.5944 1.1083 32.9838 1.7639 11.8018 2.1249 5.4883 25.7826 393.1703 90.4722 53.0169 26.1496 166.8042 0.1101 1.5214 1.1987 27.8129 121.5741 38.8319 62.5973 2.1833 3.4530 42.6481 2.1264 0.9439 54.3279 140.9171 95.9262 54.3292 20.2912 5.4467 8.2875 14.0905 9.5297 322.2776 53.0627
temp: 298.150 k
press: 1.00000 atm
elementType: 8 8 8 7 6 6 6 6 6 6 6 6 6 6 6 6 6 6 6 6 1 1 1 1 1 1 1 1 1 1 1 1 1 1 1 1 1 1 1 1 1 1 1
symmnumber: 1
zpe: 950219.6 jmol-1
zpe.correction: 0.361920 hartree
zpe.thermalcorrener: 0.383405 hartree
zpe.thermalcorrenthalpy: 0.384349 hartree
zpe.thermalcorrgfe: 0.305813 hartree
zpe.sumelectzpe: -902.427569 hartree
zpe.sumelectthermal: -902.406084 hartree
zpe.sumelectthermalent: -902.405140 hartree
zpe.sumelectthermalfe: -902.483676 hartree
dipole: -0.6215 -3.4570 1.4637
dipole: 3.8052
quadrupole: -107.8761 -118.2379 -122.4456
quadrupole: 10.4559 3.6936 2.1781
quadrupole: 8.3105 -2.0514 -6.2591 10.4559 3.6936 2.1781
hfenergy: -902.7894889 hartree
pointgroup: C01 [X(C16H23N1O3)]
dipole: -0.2286906 1.1950626 -0.872207 debye
polarizability: 243.102332|-14.8125704|192.8005448|-28.0767613|-20.7307617|146.1561147 unknown
InChI: InChI=1S/C16H23NO3/c1-2-3-4-5-6-9-12-17-15(18)13-10-7-8-11-14(13)16(19)20/h7-8,10-11,17,19H,2-6,9,12H2,1H3
charge 0 multiplicity 1
43 atoms
O  -1.900559 -2.319802 0.992921
O  -1.512994 2.695565 -1.891496
O  -0.672969 0.601592 -2.28499
N  -0.794326 -1.720608 -0.950881
C  3.506597 -0.999359 0.345769
C  2.275924 -1.324593 -0.530389
C  4.373862 0.148108 -0.220341
C  1.403519 -2.457176 0.054869
C  5.616091 0.461472 0.64364
C  0.177253 -2.821068 -0.818663
C  6.477844 1.615592 0.08149
C  7.722897 1.915254 0.944183
C  -1.769874 -1.533421 -0.007193
C  -2.792949 -0.396993 -0.181916
C  -2.698757 0.864523 -0.874275
C  -3.986927 -0.65234 0.546826
C  -3.781084 1.792638 -0.788161
C  -5.058781 0.257947 0.593798
C  -4.955214 1.496904 -0.07677
C  -1.551834 1.309116 -1.71572
H  4.130872 -1.911063 0.454722
H  3.167036 -0.732722 1.368445
H  2.617551 -1.60937 -1.548483
H  1.662086 -0.408936 -0.652929
H  4.700302 -0.112191 -1.249292
H  3.752366 1.063379 -0.314786
H  1.044031 -2.180805 1.064713
H  2.0188 -3.372465 0.175815
H  6.2417 -0.451526 0.732018
H  5.292234 0.715912 1.674713
H  0.507467 -3.10115 -1.837059
H  -0.349272 -3.68057 -0.36784
H  6.794227 1.363297 -0.951494
H  5.853694 2.529151 0.000282
H  -0.669075 -1.011798 -1.692307
H  7.432536 2.197625 1.97385
H  8.378814 1.026903 1.013853
H  8.320225 2.744309 0.521841
H  -4.023629 -1.593924 1.102639
H  -3.679285 2.752358 -1.299854
H  -5.962249 0.006021 1.159427
H  -5.772912 2.224039 -0.04233
H  -0.751442 2.913179 -2.494145
