program: Gaussian 09
title: 000222871
version: EM64L-G09RevD.01
frameworkgroup: C1[X(C8H11NO2S)]
method: RPBEPBE
basis: SDD
operation: Freq
keyword: #p
keyword: freq=noraman
keyword: PBEPBE/SDD
title: #p freq=noraman PBEPBE/SDD
converged: YES YES NO NO
title: Mulliken charges:
elementType: S O O N C C C C C C C C H H H H H H H H H H H
charge: 0.928813 -0.540726 -0.537558 -0.712156 -0.197429 0.479192 -0.452301 0.470601 -0.387250 -0.350343 -0.809120 -0.800871 0.304571 0.240810 0.236707 0.270372 0.276595 0.218097 0.234754 0.233106 0.236080 0.322817 0.335238
chargesum: 0.00000
title: Mulliken charges with hydrogens summed into heavy atoms:
elementType: S O O N C C C C C C C C
charge: 0.928813 -0.540726 -0.537558 -0.054101 -0.197429 0.479192 -0.147729 0.470601 -0.146440 -0.113636 -0.044055 -0.096931
polarizability: 1.59846310e+02 6.97732045e+00 1.32792115e+02 4.86431511e-01 -1.04497367e+00 7.94597969e+01
1716.lowfreq: -14.8835 -5.4966 -0.0013 0.0025 0.0027 7.2426 27.1416 54.2627 100.8067
frequency: 27.0742 54.2501 100.7165 118.8189 138.7122 150.6198 169.9140 212.6588 242.5616 256.2671 285.2999 305.0737 310.3799 330.0683 409.1466 443.6528 448.3081 458.0031 490.6243 558.4331 662.7090 707.6805 732.2393 802.3538 810.6072 834.1009 850.8956 910.5013 914.1647 973.4675 975.9243 1012.4911 1019.1748 1049.0614 1055.4536 1066.7724 1154.3512 1213.6105 1224.7266 1276.3362 1352.1456 1397.8224 1400.3933 1402.2495 1457.3910 1467.8491 1470.9639 1482.9184 1492.5431 1534.2506 1561.0168 1622.9630 2981.2891 2987.9863 3060.0191 3072.4788 3092.8824 3099.7801 3123.8429 3142.7247 3148.0352 3351.7874 3516.4090
redmass: 1.0314 5.1110 2.6503 1.5159 2.1298 4.3518 1.7160 5.8486 4.5474 2.3244 3.8335 3.2400 4.2072 5.7454 6.1440 3.6329 3.5881 4.5905 4.2632 3.7796 6.9176 3.2045 4.3493 13.4111 1.5375 1.2694 4.9025 4.4844 1.3065 1.3470 1.5675 1.5590 2.1484 1.5545 1.5163 1.4498 1.3137 1.6051 7.0959 1.4257 3.6176 1.2557 3.6686 1.2142 1.0450 1.1295 1.0454 1.1144 2.9440 1.0897 4.7395 7.1838 1.0375 1.0366 1.0977 1.0969 1.0988 1.1006 1.0877 1.0919 1.0965 1.0416 1.0993
irintensity: 0.3537 3.3147 4.3283 1.8967 5.5947 0.5010 19.8599 7.0308 3.9143 16.7279 4.9436 3.0484 2.8605 2.5644 42.8494 21.2282 11.7780 14.5162 162.4563 2.6049 3.0075 4.3573 5.3450 70.9456 79.5960 25.9438 24.9501 89.1281 4.6251 0.2811 2.3201 0.0962 6.3690 5.0673 18.2348 26.8398 12.6306 5.4084 1.6952 4.5078 9.5076 9.6549 0.0890 22.8641 16.5714 1.2649 14.6356 39.4157 49.8327 25.3390 2.8946 3.2625 28.6763 14.9246 17.5857 3.5808 14.5734 15.4159 9.3475 2.0866 28.0645 21.1160 20.0144
temp: 298.150 k
press: 1.00000 atm
elementType: 16 8 8 7 6 6 6 6 6 6 6 6 1 1 1 1 1 1 1 1 1 1 1
symmnumber: 1
zpe: 460424.4 jmol-1
zpe.correction: 0.175366 hartree
zpe.thermalcorrener: 0.189025 hartree
zpe.thermalcorrenthalpy: 0.189969 hartree
zpe.thermalcorrgfe: 0.134698 hartree
zpe.sumelectzpe: -913.634684 hartree
zpe.sumelectthermal: -913.621025 hartree
zpe.sumelectthermalent: -913.620081 hartree
zpe.sumelectthermalfe: -913.675352 hartree
dipole: -3.3162 1.7776 3.1043
dipole: 4.8779
quadrupole: -70.1693 -79.3350 -82.3345
quadrupole: 3.0304 9.9781 -3.2058
quadrupole: 7.1103 -2.0554 -5.0549 3.0304 9.9781 -3.2058
hfenergy: -913.8100499 hartree
pointgroup: C01 [X(C8H11N1O2S1)]
dipole: -1.3180838 0.6069771 1.2558791 debye
dipolederiv: 1.8121537 -0.1680963 0.1863624 -0.2269074 1.3043398 -0.0079179 0.1747688 -0.0063104 1.4980676 -0.6839461 0.0629232 -0.0506887 0.057726 -0.7433325 -0.1341804 -0.0179089 0.0273182 -0.5157003 -0.748774 0.010089 0.0876122 0.0296461 -0.5486019 0.1138733 0.0262363 0.0334849 -0.5685151 -0.6475009 0.0610808 -0.1656504 0.0504054 -0.464835 -0.0825308 -0.2061989 -0.1323893 -0.7767094 0.0548974 -0.0559843 0.0145011 -0.1219541 -0.0862665 0.018165 0.0539399 0.007579 -0.1926341 -0.0159968 0.3942554 0.0253181 0.0147111 0.0891124 0.0064626 0.0089426 -0.0016582 0.0227029 -0.2516206 -0.2219184 -0.020839 0.24585 -0.1696129 0.0054872 0.0215374 0.0072695 -0.1145713 0.25652 0.339925 0.0291367 0.173781 0.082279 0.0093717 0.0026725 0.0104533 -0.0234074 -0.1221986 -0.2362311 -0.020414 0.0397763 0.0339368 0.0196869 -0.0086323 0.0232256 -0.1446967 0.0813207 -0.0585372 -0.0117559 -0.1493899 -0.0076037 0.0121071 -0.0120477 0.0093241 -0.1413984 -0.1662799 -0.1713712 -0.0203016 -0.0942562 0.0062995 0.0147567 0.0024278 0.0112396 -0.0177874 -0.1313258 -0.1315659 -0.0137212 -0.0394897 0.0138147 -0.0040172 -0.0067542 -0.0061704 0.064232 0.1753433 0.0194404 0.0087066 -0.0182429 0.0415215 -0.012996 0.0058566 -0.0121242 0.1497351 0.043839 0.0251925 0.0018075 0.0466514 -0.1018159 -0.0226136 0.0062673 -0.024244 0.1496304 -0.1116986 0.0533279 0.0067221 0.0477728 0.0853097 -0.0060309 0.0099701 -0.0059209 0.1439709 0.0434285 -0.0344599 -0.0710871 -0.020491 0.0872323 0.0464807 -0.0847355 0.006851 0.00947 0.0663028 -0.0520304 0.0680285 -0.0316706 0.1047454 -0.046919 0.0703118 0.0081011 0.0148125 0.0401921 0.1556017 0.0126847 0.03863 -0.116284 -0.022487 0.0011753 -0.0313246 0.1177027 0.0572648 0.1204938 0.0106006 0.0108648 -0.0968283 -0.0165223 0.0018464 -0.0168762 0.1093788 -0.0214617 -0.0447394 0.0952372 -0.0343208 0.0606322 -0.0402805 0.1335745 0.0132237 -0.0402248 -0.0198254 -0.0290741 -0.1018069 -0.0130092 0.0546192 0.0541495 -0.1343311 0.0036507 -0.0306594 0.1866872 -0.0473274 -0.1025025 -0.0545344 0.098358 0.0464034 -0.0337338 0.0409911 0.1766795 0.1026789 0.0090059 0.0320497 0.0484514 0.2729801 0.0495515 -0.0151849 0.0343063 0.1099223 unknown
polarizability: 159.8694152|6.7511255|132.5622338|2.0740462|3.2383568|79.6665736 unknown
InChI: InChI=1S/C8H11NO2S/c1-6-3-4-7(2)8(5-6)12(9,10)11/h3-5H,9H2,1-2H3
charge 0 multiplicity 1
23 atoms
S  1.902105 -0.71869 -0.156825
O  1.790056 -2.337434 -0.319043
O  2.80274 0.155732 -1.19202
N  2.601631 -0.301533 1.50765
C  0.132271 -0.045843 -0.02232
C  -0.099974 1.342242 0.102511
C  -0.867597 -1.02976 -0.099022
C  -2.226825 -0.637494 -0.045763
C  -1.472932 1.706395 0.154615
C  -2.505605 0.747976 0.08317
C  0.99565 2.384073 0.189514
C  -3.343746 -1.661785 -0.129703
H  -0.579402 -2.081092 -0.209173
H  -1.72416 2.768538 0.254187
H  -3.549613 1.081642 0.125529
H  1.656332 2.177992 1.051492
H  1.633616 2.368613 -0.711556
H  0.563664 3.391424 0.306026
H  -2.947414 -2.687176 -0.215282
H  -3.991829 -1.622724 0.765638
H  -3.989688 -1.475868 -1.007942
H  2.443572 -1.101067 2.145044
H  3.607448 -0.10386 1.363374
