program: Gaussian 09
title: 000217731
version: EM64L-G09RevD.01
frameworkgroup: C1[X(C20H26N2O2)]
method: RPBEPBE
basis: SDD
operation: Freq
keyword: #p
keyword: freq=noraman
keyword: PBEPBE/SDD
title: #p freq=noraman PBEPBE/SDD
converged: YES YES NO NO
title: Mulliken charges:
elementType: O O N N C C C C C C C C C C C C C C C C C C C C H H H H H H H H H H H H H H H H H H H H H H H H H H
charge: -0.290583 -0.267055 -0.403303 -0.460789 -0.177849 -0.329940 0.140682 -0.376605 -0.708759 0.310217 0.306399 -0.359998 -0.575096 0.379449 -0.676339 -0.362135 -0.844094 -0.395416 0.401519 -0.399508 -0.400276 -0.226968 -0.218266 -0.241445 0.241161 0.214820 0.190954 0.265628 0.213238 0.190445 0.268612 0.216730 0.210028 0.404125 0.304039 0.251102 0.210654 0.212019 0.223388 0.248477 0.228682 0.228623 0.238754 0.222746 0.220480 0.226879 0.267099 0.225403 0.224719 0.227355
chargesum: 0.00000
title: Mulliken charges with hydrogens summed into heavy atoms:
elementType: O O N N C C C C C C C C C C C C C C C C C C C C
charge: -0.290583 -0.267055 -0.137675 -0.056664 0.063312 0.075833 0.140682 0.027078 -0.013390 0.310217 0.306399 -0.055960 -0.323994 0.379449 -0.030278 -0.113658 -0.148034 0.047810 0.401519 -0.172629 -0.133177 -0.001566 0.006453 -0.014090
polarizability: 3.81044559e+02 -1.04776331e+01 2.45146605e+02 -2.55147852e+00 4.30675853e+00 1.31248856e+02
1716.lowfreq: -11.3142 -10.0057 -6.4033 -2.7891 -0.0009 0.0008 0.0011 3.9416 18.7547
frequency: -10.5751 -1.5895 18.7248 25.9362 40.9293 47.6651 49.2765 80.2160 90.3916 94.1339 112.2100 134.9504 149.3174 160.0056 189.2055 210.9812 213.2334 219.2605 221.1395 231.8671 247.3487 261.6380 287.0290 333.9918 339.1811 389.4611 395.2090 402.1355 416.1602 447.9179 465.1801 482.5158 503.4777 532.2026 547.5544 578.7744 588.4477 615.9263 626.6506 702.3478 713.5878 728.2361 729.3632 736.1182 741.8343 755.1536 811.0725 820.5275 826.1154 855.2973 865.2601 875.2325 885.2899 902.8055 910.1338 912.1647 925.5610 941.0014 969.6453 978.8896 980.0664 989.8156 995.2826 1016.8857 1022.4180 1028.6096 1035.1850 1042.1003 1048.2897 1067.5017 1083.6661 1086.6719 1119.4210 1126.3179 1132.6490 1167.3296 1171.4160 1172.1814 1185.5866 1197.4198 1208.7424 1215.5854 1227.0708 1237.6094 1269.7252 1277.5886 1279.6759 1289.2690 1293.1577 1312.0828 1325.0396 1355.1690 1372.3268 1378.9216 1379.8834 1391.5918 1393.1792 1397.1006 1428.8771 1439.6682 1442.1441 1457.0593 1464.3710 1471.1708 1471.2654 1474.6417 1478.4001 1480.0248 1481.3809 1485.8601 1491.9934 1494.6636 1518.0122 1584.8337 1595.7106 1614.5497 1618.7511 1631.2887 2896.2061 2931.1956 2961.2284 2968.7781 2978.4177 2981.4311 2987.3692 2992.4972 3008.3787 3031.2214 3032.2190 3073.4878 3075.1105 3081.2040 3089.6337 3104.5681 3111.6990 3126.3330 3140.3495 3148.3539 3158.3387 3159.6951 3173.9034 3181.6274 3241.6812 3416.3668
redmass: 3.2075 3.8699 4.9454 3.7841 2.7504 4.2828 2.4403 4.5447 3.2644 3.5161 3.9044 3.0882 3.8522 1.1355 3.6618 1.9793 1.5154 1.4590 2.8290 1.9041 3.5588 4.9248 4.0242 4.8947 3.6895 4.4536 4.9947 2.8592 2.9231 3.1017 2.9675 4.4312 3.9406 5.4553 5.1389 3.5136 3.5736 6.3839 5.9617 2.2401 3.7721 3.8141 3.3137 1.7616 1.5404 1.0843 3.7777 4.0251 1.4096 1.2510 2.4916 1.4348 1.4848 2.2660 1.4211 1.3945 3.0956 1.1280 1.3203 1.4065 1.9825 6.2013 1.3315 1.8753 2.1797 2.1664 2.9243 1.5355 2.1633 2.6144 1.5924 1.8399 1.9777 1.9473 3.1808 2.1047 1.1380 1.6828 1.1127 2.3702 1.3754 1.6385 1.9535 1.3693 1.5052 1.3291 1.5284 1.2308 1.7462 1.4079 1.3766 1.7732 1.5154 1.7328 2.1447 3.4937 1.2116 1.3307 2.7256 2.1532 1.2023 1.7415 1.0765 1.1552 1.0659 1.0453 1.0428 1.0598 1.0643 2.1854 1.1126 1.4575 2.5681 6.0223 6.2192 7.7054 6.0525 6.6694 1.0693 1.0570 1.0393 1.0622 1.0363 1.0375 1.1030 1.0827 1.0886 1.0974 1.1005 1.1008 1.0998 1.0992 1.0962 1.0990 1.0876 1.0867 1.0930 1.0917 1.0981 1.0887 1.0968 1.0957 1.0765 1.0737
irintensity: 0.2404 0.1566 0.8702 0.1008 1.7634 1.0076 0.3271 2.0071 0.6488 6.3207 1.8626 0.7928 3.0655 0.1709 1.3623 2.1320 1.5531 1.2805 0.5846 1.3563 1.8852 3.7622 3.8608 10.6434 3.1675 3.4215 0.6818 0.1955 4.3946 5.0759 14.3536 16.7848 6.7345 0.5060 0.9789 5.5957 7.9166 0.0232 8.6475 31.0355 4.4275 5.9224 28.7138 81.4712 65.2133 6.2045 2.5350 3.2021 51.4592 0.0351 5.5360 22.7107 8.0530 3.0375 1.9267 10.7564 20.5519 48.4292 3.0597 0.8355 14.7985 0.2296 0.5419 45.8311 110.4880 8.9290 17.5744 8.0194 4.9299 35.6400 9.3617 9.7883 44.5234 3.5404 79.4173 36.5470 21.5886 86.2741 2.2879 11.6341 0.3334 45.6728 53.0433 2.1239 58.0931 49.9058 58.6658 10.5963 7.2235 10.6177 8.4367 16.6391 8.0688 6.7964 30.3170 9.1829 12.8293 16.3733 38.8648 10.5546 26.6342 194.1343 6.1196 64.0759 6.7314 11.6766 12.7271 12.6695 0.5738 4.7312 13.8787 34.0300 763.9794 6.1960 1.0561 229.0662 7.7838 46.3332 99.0764 28.8390 36.1732 34.6363 35.7525 31.9062 30.7559 7.5239 17.5943 20.7064 34.8380 70.8143 43.6819 40.5965 21.1436 10.6543 10.0990 0.8228 31.3884 7.8923 39.4722 13.7910 7.9720 12.6827 383.2670 0.0598
temp: 298.150 k
press: 1.00000 atm
elementType: 8 8 7 7 6 6 6 6 6 6 6 6 6 6 6 6 6 6 6 6 6 6 6 6 1 1 1 1 1 1 1 1 1 1 1 1 1 1 1 1 1 1 1 1 1 1 1 1 1 1
symmnumber: 1
zpe: 1099274.7 jmol-1
zpe.correction: 0.418692 hartree
zpe.thermalcorrener: 0.441743 hartree
zpe.thermalcorrenthalpy: 0.442688 hartree
zpe.thermalcorrgfe: 0.364376 hartree
zpe.sumelectzpe: -1035.900590 hartree
zpe.sumelectthermal: -1035.877539 hartree
zpe.sumelectthermalent: -1035.876595 hartree
zpe.sumelectthermalfe: -1035.954906 hartree
dipole: 3.3585 2.6021 0.6619
dipole: 4.2999
quadrupole: -105.7700 -144.2579 -147.9883
quadrupole: 14.1993 4.5272 -1.9426
quadrupole: 26.9020 -11.5858 -15.3162 14.1993 4.5272 -1.9426
hfenergy: -1036.319282 hartree
pointgroup: C01 [X(C20H26N2O2)]
dipole: -1.2535101 0.8218236 0.7843263 debye
polarizability: 381.8315965|0.0741808|166.6722691|2.7813426|52.6447591|208.9361548 unknown
InChI: InChI=1S/C20H26N2O2/c1-4-12-21-16(3)20(23)22-19-11-10-18(13-15(19)2)24-14-17-8-6-5-7-9-17/h5-11,13,16,21-22H,4,12,14H2,1-3H3
charge 0 multiplicity 1
50 atoms
O  3.046369 0.177021 0.026888
O  -3.009794 -1.767572 -2.158413
N  -5.092377 0.483903 -0.081623
N  -2.576073 -0.161782 -0.470606
C  -4.900525 -0.681811 -0.995626
C  -6.083304 0.306196 1.012991
C  -3.386795 -0.925777 -1.283442
C  -6.177828 1.573099 1.885693
C  -5.687531 -0.576973 -2.321345
C  -1.159896 -0.119655 -0.390893
C  -0.565543 0.778031 0.555547
C  -0.335342 -0.929492 -1.210454
C  0.838104 0.830108 0.64801
C  1.660344 0.018982 -0.170881
C  -7.186998 1.415235 3.04308
C  1.070568 -0.863638 -1.105075
C  -1.426446 1.659031 1.444912
C  3.937703 -0.658882 -0.783925
C  5.375637 -0.382581 -0.38299
C  6.4207 -0.753588 -1.26593
C  5.699529 0.201715 0.864778
C  7.771156 -0.555522 -0.902953
C  7.051229 0.405942 1.225046
C  8.091373 0.025588 0.346275
H  -5.246037 -1.58715 -0.456736
H  -5.752121 -0.546336 1.636986
H  -7.099027 0.050295 0.626955
H  -5.298919 1.337372 -0.622605
H  -5.170994 1.805629 2.284105
H  -6.474523 2.434312 1.251296
H  -5.450206 -1.438694 -2.966625
H  -6.775654 -0.556747 -2.129915
H  -5.407503 0.341066 -2.872349
H  -3.163361 0.442803 0.13962
H  -0.810443 -1.605018 -1.925436
H  1.320869 1.507129 1.360469
H  -8.205196 1.211148 2.662036
H  -6.902013 0.578624 3.708047
H  -7.234709 2.332062 3.657312
H  1.678101 -1.500136 -1.754456
H  -2.066172 2.343047 0.852919
H  -2.09753 1.060313 2.092532
H  -0.799549 2.281146 2.104384
H  3.687522 -1.729051 -0.613327
H  3.786216 -0.440411 -1.861795
H  6.180811 -1.196269 -2.241498
H  4.889184 0.502018 1.534896
H  8.569753 -0.846532 -1.594644
H  7.291721 0.862751 2.191893
H  9.138421 0.183956 0.628069
