program: Gaussian 09
title: 000217727
version: EM64L-G09RevD.01
frameworkgroup: C1[X(C21H28N2O2)]
method: RPBEPBE
basis: SDD
operation: Freq
keyword: #p
keyword: freq=noraman
keyword: PBEPBE/SDD
title: #p freq=noraman PBEPBE/SDD
converged: YES YES NO NO
title: Mulliken charges:
elementType: O O N N C C C C C C C C C C C C C C C C C C C C C H H H H H H H H H H H H H H H H H H H H H H H H H H H H
charge: -0.290961 -0.265526 -0.395965 -0.460720 -0.179559 -0.353848 -0.368175 -0.341806 0.137232 -0.703877 0.310805 0.305128 -0.688062 -0.359939 -0.575192 0.380518 -0.362231 -0.843901 -0.394079 0.398951 -0.401925 -0.396910 -0.218131 -0.227286 -0.241465 0.240368 0.189676 0.214870 0.181054 0.205658 0.263212 0.195574 0.194420 0.215038 0.267489 0.209690 0.402809 0.211714 0.219452 0.209915 0.304139 0.251058 0.248506 0.228649 0.229599 0.238702 0.220697 0.222716 0.267807 0.226716 0.224679 0.225383 0.227337
chargesum: 0.00000
title: Mulliken charges with hydrogens summed into heavy atoms:
elementType: O O N N C C C C C C C C C C C C C C C C C C C C C
charge: -0.290961 -0.265526 -0.132753 -0.057910 0.060808 0.050698 0.018537 0.048188 0.137232 -0.011661 0.310805 0.305128 -0.046980 -0.055800 -0.324134 0.380518 -0.113725 -0.146951 0.049333 0.398951 -0.134118 -0.170194 0.006547 -0.001903 -0.014128
polarizability: 3.91312812e+02 -1.58859979e+01 2.57061438e+02 5.34630080e+00 1.58761552e+01 1.43012527e+02
1716.lowfreq: -9.7130 -5.2163 -0.0013 0.0006 0.0013 0.8623 7.3185 13.1174 16.2291
frequency: -8.4374 12.9691 16.0663 25.1645 42.3880 46.9929 50.1809 72.2933 83.5990 91.9213 105.7124 114.8396 122.3682 145.7337 170.3071 183.5188 212.0951 214.1663 222.5750 225.8224 229.3419 240.9136 251.7587 264.6339 308.5414 317.5566 383.8138 390.2303 402.2902 411.5945 424.3539 450.8548 467.0422 482.7774 503.5780 532.5622 542.0142 580.3046 590.8228 616.5176 627.1279 702.5807 715.9431 728.5209 729.7316 733.8837 737.9345 741.6909 801.6074 810.6843 820.2266 824.9935 855.8020 867.5166 876.7145 893.1132 909.9534 912.2198 924.6244 937.8904 941.9741 970.6619 979.5969 982.2731 989.8980 995.7325 1015.1611 1017.0000 1022.9516 1029.5609 1042.1194 1044.1912 1065.0908 1081.9433 1084.1993 1085.8677 1119.8482 1123.6847 1133.7724 1169.1146 1171.5744 1173.0635 1185.4423 1195.3202 1205.8557 1214.6131 1220.7384 1226.5715 1257.3792 1269.3467 1279.7798 1280.6402 1284.3366 1291.6852 1308.9543 1310.9926 1345.5860 1354.0331 1372.1044 1379.3798 1380.1283 1390.7884 1391.4001 1399.3168 1429.4414 1439.5177 1440.9274 1457.8896 1464.0206 1467.1465 1469.8207 1473.9259 1476.8134 1477.4514 1478.6823 1484.8839 1486.6003 1492.9944 1495.3928 1519.2172 1585.5383 1595.8257 1615.2036 1619.5938 1631.1127 2896.4706 2930.3336 2956.8162 2962.3028 2970.5697 2974.9297 2981.8264 2985.3073 2990.7070 3001.7793 3013.4852 3032.4241 3037.6802 3071.5974 3075.5691 3075.7832 3090.4132 3104.8015 3112.0807 3126.6530 3140.7656 3149.2688 3156.5955 3158.9386 3175.1830 3182.0049 3258.7393 3406.1961
redmass: 3.7289 4.3109 4.3051 3.7557 1.9720 3.5768 4.6505 4.1936 3.5826 3.3066 4.1665 2.6917 2.3884 3.8745 1.2766 2.8720 2.6484 2.4908 1.6412 2.1023 1.1346 3.5716 3.8639 4.1356 4.0997 5.1642 4.5730 4.3480 2.8489 2.9454 3.3697 3.1276 2.8702 4.7466 3.9215 5.6065 5.2104 3.2506 3.8311 6.3600 5.8486 2.2481 3.8940 3.4464 2.8687 1.7480 1.1935 1.5060 1.1828 3.6791 4.0280 1.4131 1.2510 2.4129 1.4285 2.5884 1.6713 1.4597 2.9912 1.1349 1.1945 1.3184 1.3823 2.0463 6.1696 1.3360 3.3816 1.8197 2.2254 2.1752 2.0605 1.5865 3.0502 1.8661 1.6251 2.0607 1.9598 2.1609 3.0465 1.9258 1.0722 1.9766 1.1130 2.2728 1.2658 1.7038 1.5983 2.0117 1.2776 1.5027 1.3345 1.4944 1.0703 2.0230 1.2798 1.4241 1.4845 1.7115 1.5109 1.5862 2.4729 1.2201 3.8686 1.3060 2.7656 2.1635 1.1987 1.7533 1.0825 1.0710 1.1461 1.0640 1.0464 1.0425 1.0586 1.0718 2.2299 1.1097 1.4593 2.5069 5.9644 6.2105 7.3400 6.0628 6.6564 1.0690 1.0565 1.0614 1.0393 1.0599 1.0363 1.0381 1.1035 1.0819 1.0918 1.0957 1.0975 1.1027 1.1008 1.0994 1.0999 1.0961 1.0989 1.0876 1.0867 1.0930 1.0918 1.0893 1.0983 1.0965 1.0954 1.0763 1.0735
irintensity: 0.1977 0.0853 0.3654 0.4633 0.2405 1.3118 1.5409 2.8326 0.8305 4.4283 0.8587 0.6113 4.3970 0.9558 0.2564 1.7254 2.2091 1.2705 1.0720 0.4531 0.0838 2.3803 1.5240 1.6842 4.5462 11.5163 4.5626 2.6813 0.1852 3.5591 1.3747 5.0794 11.9858 17.0098 2.8928 2.0588 2.2509 4.6806 12.5595 0.0406 7.2367 31.2896 0.3677 4.6685 40.7260 28.1736 56.1095 68.9260 1.3621 3.2176 2.7416 51.3478 0.0273 9.1926 22.8384 9.5576 6.1588 4.3466 22.7607 15.3884 34.9162 3.2506 0.1596 17.1247 0.2272 0.4317 3.5283 32.0252 121.7679 13.1739 12.7031 12.4132 14.6545 9.3951 9.1197 23.8589 42.4493 0.4725 85.7040 57.3120 2.9052 86.5925 2.3175 8.5644 0.3736 42.9398 1.7977 61.5090 1.3663 62.2497 44.0272 56.2316 0.9924 13.8673 13.3710 9.8318 3.7517 17.3589 15.0436 8.8083 30.0968 11.5826 9.1639 14.3703 44.2964 9.9969 28.4594 177.2019 6.2500 1.4868 62.7801 1.2849 12.4636 13.8547 11.5738 12.1879 5.6742 10.9192 46.9581 762.9644 6.8317 1.1975 223.1454 8.4607 47.5022 94.1871 28.6221 11.9992 35.1150 59.5108 33.4175 30.0946 30.4187 9.0307 13.6374 5.3429 20.7756 63.6153 82.7020 35.6339 60.6576 20.8334 11.4944 10.1384 0.8278 31.5609 7.6119 16.6993 38.2949 7.4540 10.8345 375.6553 0.1059
temp: 298.150 k
press: 1.00000 atm
elementType: 8 8 7 7 6 6 6 6 6 6 6 6 6 6 6 6 6 6 6 6 6 6 6 6 6 1 1 1 1 1 1 1 1 1 1 1 1 1 1 1 1 1 1 1 1 1 1 1 1 1 1 1 1
symmnumber: 1
zpe: 1172985.5 jmol-1
zpe.correction: 0.446767 hartree
zpe.thermalcorrener: 0.472039 hartree
zpe.thermalcorrenthalpy: 0.472983 hartree
zpe.thermalcorrgfe: 0.388041 hartree
zpe.sumelectzpe: -1075.123414 hartree
zpe.sumelectthermal: -1075.098142 hartree
zpe.sumelectthermalent: -1075.097198 hartree
zpe.sumelectthermalfe: -1075.182139 hartree
dipole: 3.5238 2.4000 0.6333
dipole: 4.3103
quadrupole: -112.7082 -154.5975 -153.1699
quadrupole: 10.6663 3.0512 2.2061
quadrupole: 27.4503 -14.4390 -13.0114 10.6663 3.0512 2.2061
hfenergy: -1075.5701806 hartree
pointgroup: C01 [X(C21H28N2O2)]
dipole: -1.3707186 -0.8827214 -0.4665272 debye
polarizability: 392.0238958|-9.516056|224.1376127|-8.4555954|53.7423435|175.2252676 unknown
InChI: InChI=1S/C21H28N2O2/c1-4-5-13-22-17(3)21(24)23-20-12-11-19(14-16(20)2)25-15-18-9-7-6-8-10-18/h6-12,14,17,22-23H,4-5,13,15H2,1-3H3
charge 0 multiplicity 1
53 atoms
O  3.284461 -0.21472 -0.174721
O  -2.427564 2.616749 1.956746
N  -4.824824 0.206707 0.501488
N  -2.245707 0.712898 0.559302
C  -4.478559 1.522891 1.116154
C  -5.975368 0.207788 -0.441388
C  -6.224957 -1.201411 -1.012212
C  -7.410347 -1.243693 -2.003603
C  -2.933961 1.674854 1.269712
C  -5.182433 1.802616 2.463378
C  -0.846015 0.530898 0.410205
C  -0.392185 -0.556508 -0.406218
C  -7.652613 -2.653749 -2.583316
C  0.095785 1.383355 1.037634
C  0.993056 -0.752364 -0.561991
C  1.932618 0.098434 0.068743
C  1.481239 1.172161 0.870399
C  -1.380376 -1.483472 -1.093682
C  4.293489 0.6252 0.478091
C  5.674786 0.09151 0.14295
C  5.867073 -1.229616 -0.326754
C  6.802726 0.926885 0.341709
C  7.171229 -1.708878 -0.587906
C  8.105761 0.445808 0.086573
C  8.294614 -0.876428 -0.379409
H  -4.781131 2.307717 0.39344
H  -6.91248 0.582157 0.035958
H  -5.734727 0.903879 -1.268168
H  -6.422885 -1.909165 -0.178867
H  -5.301315 -1.553797 -1.513427
H  -4.962494 -0.505846 1.23533
H  -7.219213 -0.530837 -2.831373
H  -8.329202 -0.889827 -1.493277
H  -6.279125 1.837486 2.332849
H  -4.836613 2.765225 2.874546
H  -4.938092 1.016668 3.203023
H  -2.916804 0.06505 0.100316
H  -6.759163 -3.019666 -3.12321
H  -8.500507 -2.657391 -3.292158
H  -7.880423 -3.380103 -1.780581
H  -0.271747 2.207879 1.65262
H  1.369229 -1.573692 -1.180737
H  2.181051 1.850737 1.366266
H  -2.022191 -2.016787 -0.36462
H  -2.052369 -0.93231 -1.781041
H  -0.852685 -2.246322 -1.689107
H  4.18953 1.676612 0.13676
H  4.128044 0.604716 1.577628
H  4.992459 -1.864352 -0.493865
H  6.664622 1.957078 0.695029
H  7.309445 -2.73238 -0.954837
H  8.969418 1.101638 0.244291
H  9.304638 -1.250282 -0.581573
