program: Gaussian 09
title: 000217725
version: EM64L-G09RevD.01
frameworkgroup: C1[X(C21H28N2O2)]
method: RPBEPBE
basis: SDD
operation: Freq
keyword: #p
keyword: freq=noraman
keyword: PBEPBE/SDD
title: #p freq=noraman PBEPBE/SDD
converged: YES YES NO NO
title: Mulliken charges:
elementType: O O N N C C C C C C C C C C C C C C C C C C C C C H H H H H H H H H H H H H H H H H H H H H H H H H H H H
charge: -0.259951 -0.288372 -0.188055 -0.454565 -0.172916 -0.314163 -0.356454 0.135607 -0.703704 -0.697315 -0.700672 0.312371 0.307442 -0.360907 -0.576460 0.376734 -0.360018 -0.846015 -0.400921 0.411871 -0.409510 -0.394585 -0.225941 -0.218822 -0.241094 0.231302 0.208671 0.198490 0.228770 0.216977 0.219658 0.208775 0.259006 0.219328 0.223244 0.220374 0.220619 0.219266 0.244685 0.391464 0.303354 0.251856 0.248812 0.228886 0.228204 0.240863 0.222262 0.220573 0.227840 0.264750 0.225758 0.225048 0.227582
chargesum: 0.00000
title: Mulliken charges with hydrogens summed into heavy atoms:
elementType: O O N N C C C C C C C C C C C C C C C C C C C C C
charge: -0.259951 -0.288372 -0.188055 -0.063102 0.058386 0.092997 0.089294 0.135607 -0.016265 -0.034368 -0.016101 0.312371 0.307442 -0.057553 -0.324604 0.376734 -0.111206 -0.148062 0.041915 0.411871 -0.181669 -0.129835 -0.000184 0.006226 -0.013512
polarizability: 3.92391383e+02 -7.85968702e+00 2.46809609e+02 -9.86334553e+00 -7.46995487e+00 1.49529557e+02
1716.lowfreq: -3.9636 -0.9707 -0.0007 0.0008 0.0015 5.8214 13.1338 17.2607 28.6363
frequency: 12.5910 17.0672 28.6009 37.7833 43.5764 54.9496 72.4871 87.2507 95.8496 103.7684 119.9788 130.0423 163.7729 175.7341 177.8773 199.0115 213.1723 218.5343 225.7571 232.3286 248.2061 253.8750 261.1642 280.7428 292.4570 308.3626 363.9869 367.0999 385.3773 397.4630 402.5968 448.6579 464.5414 488.2375 506.6618 530.7284 536.4148 541.9730 577.5144 586.8404 615.8739 623.8478 701.9687 706.1229 727.7047 729.5061 732.2989 743.3261 774.5143 798.7403 806.5512 821.7159 825.8246 856.1264 872.8714 876.3589 893.2530 909.1019 911.6777 919.1027 938.5711 970.8931 978.8851 979.8842 989.8896 995.4316 1006.5857 1014.8106 1021.2605 1028.6268 1041.4752 1044.1977 1060.3285 1075.7107 1084.7185 1087.4320 1104.2801 1118.1069 1122.7249 1170.4730 1171.7161 1174.0971 1185.1872 1185.8907 1203.7276 1206.3131 1215.0663 1226.7781 1266.9291 1272.8137 1279.8842 1291.0148 1312.6893 1314.2930 1341.9216 1352.8248 1355.4039 1373.7459 1376.6063 1379.3355 1383.7979 1388.2242 1391.2923 1397.5023 1429.5096 1440.5752 1453.4536 1457.4801 1463.5582 1466.0525 1470.9764 1475.0845 1476.1386 1478.2929 1486.0984 1487.0249 1487.7935 1493.4225 1497.5358 1514.0966 1584.6448 1596.2151 1613.8998 1618.9680 1631.7453 2900.5810 2931.5449 2958.3211 2971.7278 2976.9833 2983.6145 2988.3055 2989.5118 2993.9568 3017.9562 3027.9047 3039.6744 3074.9934 3081.7549 3082.3433 3088.7479 3092.3624 3101.0393 3106.0230 3113.1327 3126.7943 3140.8666 3149.4420 3158.4220 3159.0762 3172.4469 3183.2709 3282.3378
redmass: 4.0143 4.4975 3.7016 4.4240 3.7124 4.4717 4.1778 4.1160 4.9244 2.9213 2.1579 2.2707 1.9341 1.8152 1.6465 2.3804 2.3593 1.7488 1.8846 2.1615 1.9877 2.5047 3.9069 1.7299 2.4868 2.8340 4.3471 4.2278 4.9327 4.6556 2.9117 3.0996 3.0121 4.3684 3.6843 4.0249 3.7318 4.2261 3.3625 3.2821 6.3810 5.9172 2.2979 3.2235 4.0695 3.7535 3.2493 1.5838 1.1696 1.2584 3.0609 3.8317 1.4250 1.2503 2.8029 1.4320 1.6555 1.6254 1.3732 2.8066 2.1412 1.3166 1.5067 1.8755 6.1221 1.3361 2.3476 1.8131 2.2052 2.1392 1.8994 1.5274 2.2346 2.2659 1.5949 2.2224 2.1197 1.8326 1.8435 1.8124 1.0832 2.2228 2.6590 1.1314 2.2055 1.2872 1.7608 1.9818 1.5037 1.3102 1.5487 1.9050 1.3955 1.2276 1.3450 1.2939 1.7571 1.2889 1.5362 2.8446 1.2290 1.2577 3.6564 1.3122 2.7536 2.1623 1.7971 1.0859 1.0498 1.0521 1.1500 1.0483 1.0497 1.0531 2.1733 1.0702 1.0511 1.3152 1.1611 2.5969 6.1803 6.2269 7.7673 6.0653 6.6952 1.0702 1.0574 1.0393 1.0816 1.0623 1.0380 1.0372 1.1027 1.0356 1.0896 1.0974 1.0978 1.0986 1.0994 1.0998 1.0960 1.1011 1.0997 1.0984 1.0875 1.0868 1.0929 1.0918 1.0977 1.0889 1.0974 1.0955 1.0756
irintensity: 0.2791 0.4810 0.2109 0.3977 0.0625 2.0519 1.8931 0.3343 6.9183 1.0336 1.4617 1.9163 0.1464 1.6678 0.7283 3.7768 1.1703 0.4594 2.5603 0.4890 3.6827 0.9237 5.4378 1.7832 0.4114 2.8530 10.7372 1.5380 2.6786 0.0493 0.5673 4.6487 15.5169 15.9875 14.1336 9.5681 13.3364 2.5870 12.0379 10.6391 0.0738 6.3481 29.8445 6.4472 20.3319 7.6358 8.3765 61.6736 10.6996 9.3901 1.2335 3.2643 51.3322 0.0768 10.5159 22.4126 41.0971 7.6469 13.2488 6.6464 3.1183 3.4352 4.7985 16.5648 0.2747 0.6643 28.7874 32.7765 134.4686 5.2614 1.2556 8.2756 14.6303 13.0605 9.5337 31.0214 69.5961 28.8906 7.8113 113.1178 0.8925 38.0862 25.3886 1.7895 41.6320 0.9392 42.5649 44.9395 77.5713 34.8545 74.8070 9.5440 10.0724 14.5640 15.2400 11.7560 20.3054 16.9967 11.7272 33.8500 25.1835 19.9966 7.9210 15.0245 37.1520 9.8938 206.4507 10.4204 7.4074 14.3224 67.8219 24.8819 3.2978 16.4762 4.5212 6.5021 7.0136 8.4845 25.8234 715.8829 3.8114 0.9545 214.0444 7.0834 43.3025 102.3963 29.2818 37.2698 15.7348 20.3685 33.9705 28.1522 30.5996 35.2880 21.5870 22.6336 12.3564 45.4137 49.1312 40.5524 20.1860 37.6858 42.8928 6.6952 9.7369 0.8175 30.7562 7.6142 40.1481 13.6922 8.8176 10.8353 325.4175
temp: 298.150 k
press: 1.00000 atm
elementType: 8 8 7 7 6 6 6 6 6 6 6 6 6 6 6 6 6 6 6 6 6 6 6 6 6 1 1 1 1 1 1 1 1 1 1 1 1 1 1 1 1 1 1 1 1 1 1 1 1 1 1 1 1
symmnumber: 1
zpe: 1171721.7 jmol-1
zpe.correction: 0.446285 hartree
zpe.thermalcorrener: 0.472226 hartree
zpe.thermalcorrenthalpy: 0.473170 hartree
zpe.thermalcorrgfe: 0.387550 hartree
zpe.sumelectzpe: -1075.111474 hartree
zpe.sumelectthermal: -1075.085533 hartree
zpe.sumelectthermalent: -1075.084589 hartree
zpe.sumelectthermalfe: -1075.170209 hartree
dipole: 2.6780 2.6930 0.3879
dipole: 3.8177
quadrupole: -118.4227 -149.8950 -153.1303
quadrupole: 15.1923 0.0530 -4.4171
quadrupole: 22.0600 -9.4123 -12.6476 15.1923 0.0530 -4.4171
hfenergy: -1075.5577591 hartree
pointgroup: C01 [X(C21H28N2O2)]
dipole: -0.9956143 0.1061139 -1.1195833 debye
polarizability: 391.6899021|-18.6797137|157.3312015|-3.3844274|-25.6837816|239.7094461 unknown
InChI: InChI=1S/C21H28N2O2/c1-5-23(6-2)17(4)21(24)22-20-13-12-19(14-16(20)3)25-15-18-10-8-7-9-11-18/h7-14,17,22H,5-6,15H2,1-4H3
charge 0 multiplicity 1
53 atoms
O  -3.017211 0.228896 2.623833
O  3.104379 -0.128763 -0.134352
N  -5.031477 0.422563 -0.460625
N  -2.503912 0.437796 0.324262
C  -4.839913 0.676036 0.999441
C  -5.945711 1.370861 -1.149472
C  -5.168897 -1.009194 -0.865235
C  -3.35486 0.402182 1.411583
C  -5.800744 -0.023508 1.990207
C  -5.754465 1.382449 -2.678466
C  -6.596212 -1.614715 -0.874902
C  -1.092701 0.292081 0.273377
C  -0.455714 0.365329 -1.008843
C  -0.313548 0.076672 1.436915
C  0.942444 0.21949 -1.078754
C  1.719316 0.003465 0.085054
C  1.087603 -0.068997 1.348103
C  -1.266905 0.596607 -2.272475
C  3.95144 -0.340308 1.045776
C  5.402952 -0.391217 0.606298
C  6.351921 -1.053957 1.424059
C  5.837612 0.244893 -0.581436
C  7.718945 -1.069776 1.068399
C  7.204228 0.222682 -0.940956
C  8.150034 -0.430014 -0.116918
H  -4.971223 1.770508 1.134122
H  -5.722681 2.381138 -0.756962
H  -7.017252 1.168113 -0.915186
H  -4.518395 -1.601941 -0.195571
H  -4.742447 -1.118394 -1.882253
H  -5.716734 -1.12243 1.933685
H  -6.847714 0.269108 1.795122
H  -5.528869 0.270637 3.017463
H  -6.388499 2.166016 -3.131804
H  -6.035181 0.41932 -3.141112
H  -4.700954 1.595197 -2.936716
H  -6.541015 -2.669898 -1.201781
H  -7.259324 -1.08423 -1.582157
H  -7.068917 -1.591154 0.120427
H  -3.05142 0.574505 -0.546985
H  -0.818465 0.023839 2.403982
H  1.456591 0.268883 -2.044205
H  1.658329 -0.238279 2.26562
H  -2.016142 -0.204172 -2.43409
H  -1.815392 1.55909 -2.238814
H  -0.613233 0.61963 -3.159662
H  3.791624 0.496574 1.760601
H  3.664792 -1.284198 1.554533
H  6.02382 -1.561952 2.340134
H  5.098148 0.737907 -1.218959
H  8.442991 -1.585766 1.708959
H  7.530615 0.714091 -1.864652
H  9.209341 -0.445094 -0.397006
