program: Gaussian 09
title: 000217723
version: EM64L-G09RevD.01
frameworkgroup: C1[X(C20H24N2O2)]
method: RPBEPBE
basis: SDD
operation: Freq
keyword: #p
keyword: freq=noraman
keyword: PBEPBE/SDD
title: #p freq=noraman PBEPBE/SDD
converged: NO YES NO NO
title: Mulliken charges:
elementType: O O N N C C C C C C C C C C C C C C C C C C C C H H H H H H H H H H H H H H H H H H H H H H H H
charge: -0.255079 -0.308802 -0.160066 -0.461276 -0.398583 -0.388530 -0.388269 -0.376731 -0.364560 -0.460334 0.137769 0.316107 0.310909 -0.331084 -0.546528 0.341929 -0.416795 -0.847182 0.345426 -0.357369 -0.386904 -0.208868 -0.194729 -0.255441 0.220514 0.193119 0.205429 0.195762 0.199420 0.201446 0.195201 0.232253 0.218728 0.186302 0.242575 0.236249 0.392278 0.308245 0.268517 0.256780 0.230845 0.241628 0.228135 0.264816 0.256129 0.225013 0.227756 0.227850
chargesum: 0.00000
title: Mulliken charges with hydrogens summed into heavy atoms:
elementType: O O N N C C C C C C C C C C C C C C C C C C C C
charge: -0.255079 -0.308802 -0.160066 -0.068998 0.015050 0.012661 0.012596 0.050723 0.040470 0.018490 0.137769 0.316107 0.310909 -0.022839 -0.278011 0.341929 -0.160015 -0.146574 0.345426 -0.092553 -0.130776 0.016145 0.033028 -0.027591
polarizability: 3.59465055e+02 -2.77967417e+01 2.27500807e+02 -1.09656097e+01 -1.80941907e+00 1.61342043e+02
1716.lowfreq: -15.5775 -6.8867 -5.1281 -0.0006 -0.0004 0.0005 1.8310 16.3763 28.7384
frequency: -6.5081 15.7684 28.7338 36.1657 46.6845 61.1165 76.8605 94.1396 113.9157 149.9698 167.6683 187.0864 200.2606 222.1799 237.1611 240.1099 281.0733 305.8293 321.4318 329.4037 342.7605 373.2361 387.4292 410.7099 443.5937 449.5025 450.2181 476.0971 480.4467 502.2541 535.7716 548.1828 568.1842 594.8101 605.9695 608.4800 651.6055 690.8813 700.0446 731.2275 760.0755 763.0815 800.8469 804.2194 830.9580 833.3217 850.1629 853.9698 855.5930 881.5907 886.1551 902.1625 904.4232 923.5232 952.3624 953.4475 966.4585 979.2369 981.5521 984.2498 985.5334 995.0387 996.9568 1018.9890 1042.9908 1048.4698 1077.5189 1079.5226 1105.9442 1106.4106 1118.7513 1146.1592 1148.2628 1154.7605 1166.7294 1172.2886 1180.1150 1186.8517 1197.0144 1213.0766 1255.1433 1262.9960 1273.3556 1280.2639 1286.2072 1294.2385 1308.3909 1315.3769 1332.3086 1338.1570 1349.4669 1360.3812 1369.8096 1376.3956 1385.8036 1397.6107 1416.2091 1442.1023 1449.4260 1450.9933 1455.4939 1458.8191 1466.8384 1469.8883 1470.2827 1475.4250 1479.7154 1491.1401 1518.6107 1589.2787 1595.5056 1607.0417 1619.8540 1625.4612 2868.0024 2874.6933 2953.7273 2958.9243 2972.3835 2980.2562 2982.2282 3027.8458 3028.5729 3032.1202 3034.9084 3040.7894 3044.8751 3054.0522 3088.7165 3128.2314 3137.7764 3144.1350 3155.4568 3164.3711 3164.5054 3173.3677 3186.3478 3274.1434
redmass: 4.4460 4.0600 4.4245 3.3352 3.7740 4.3894 4.7691 5.8237 4.2443 3.7166 1.2233 3.2031 4.3269 3.0791 1.9525 3.2258 3.3407 4.7132 2.8435 3.6033 3.8603 5.8309 1.9257 2.9382 3.5515 2.8747 3.2472 3.0682 3.3919 3.3778 5.0804 3.9820 3.8067 2.6933 4.7792 5.0110 4.8036 2.5616 4.2549 3.6937 1.6509 3.7949 1.5848 4.4489 2.6247 1.4981 1.4137 1.7163 2.1926 1.4002 1.5195 1.5800 1.4253 3.8751 4.2890 1.3760 1.3608 1.8325 1.3801 1.2983 5.8028 2.4459 1.6386 2.0837 1.5186 2.1334 1.5049 1.4592 1.9126 2.1849 2.6083 1.3503 1.7666 2.0613 1.1231 1.1766 1.6438 2.0062 2.2443 2.7122 1.3383 1.2770 1.3240 1.3726 2.4729 1.4947 1.3463 1.4384 1.3425 1.4184 1.5028 1.4140 6.0209 1.4415 7.3709 1.3147 3.2095 2.3285 1.0992 1.1194 1.4912 1.1524 1.1301 1.1043 2.1631 1.0473 1.0992 1.4393 2.4616 6.4717 6.4209 6.7161 6.1488 7.5431 1.0708 1.0696 1.0642 1.0393 1.0635 1.0620 1.0620 1.0905 1.0970 1.0923 1.0945 1.0943 1.1016 1.1038 1.0960 1.0849 1.0892 1.0918 1.0930 1.0929 1.0932 1.1002 1.0962 1.0762
irintensity: 0.5127 0.2302 0.8045 1.0977 0.4326 0.1692 4.1908 3.1087 0.2643 3.5826 0.3560 2.0951 1.1694 1.0365 0.3604 1.5264 0.7535 2.1521 19.6350 0.6910 9.6325 1.0833 5.1889 0.5857 0.7369 3.2531 4.1126 0.7103 35.0407 11.2802 7.9895 3.8147 1.2807 3.4767 3.2290 1.3939 1.4863 25.7957 7.5864 5.3097 83.2750 22.6713 2.4683 11.9537 2.9689 2.8520 46.4472 8.9638 7.4146 18.0872 35.5554 14.8317 6.1213 13.2293 57.4232 4.8900 0.4617 17.2736 0.7799 0.7461 0.5750 33.2206 20.1712 17.7095 6.8296 11.7406 11.5993 4.9108 1.7152 30.8161 4.4587 3.7065 4.4389 18.5329 29.2305 60.5437 8.3708 4.2736 76.6854 330.5258 5.7872 0.6636 28.0506 56.4492 52.0950 14.5872 0.7140 15.2070 1.0713 0.2961 1.4015 0.9201 41.7295 26.3622 0.0323 11.7882 24.4903 4.9757 39.9428 16.5066 55.9293 41.0372 23.7687 12.4798 219.5922 17.4103 9.3865 57.9080 748.4817 17.4242 26.6464 88.2393 39.8986 216.6422 36.3624 163.9439 52.5037 35.0737 38.0566 27.9243 26.1341 19.6986 28.0117 41.0301 38.4157 30.7743 29.8858 111.2472 19.5391 2.4252 12.6958 11.3694 31.1097 5.5266 12.5201 9.1860 7.7454 335.6841
temp: 298.150 k
press: 1.00000 atm
elementType: 8 8 7 7 6 6 6 6 6 6 6 6 6 6 6 6 6 6 6 6 6 6 6 6 1 1 1 1 1 1 1 1 1 1 1 1 1 1 1 1 1 1 1 1 1 1 1 1
symmnumber: 1
zpe: 1048013.4 jmol-1
zpe.correction: 0.399167 hartree
zpe.thermalcorrener: 0.420387 hartree
zpe.thermalcorrenthalpy: 0.421332 hartree
zpe.thermalcorrgfe: 0.347200 hartree
zpe.sumelectzpe: -1034.723353 hartree
zpe.sumelectthermal: -1034.702132 hartree
zpe.sumelectthermalent: -1034.701188 hartree
zpe.sumelectthermalfe: -1034.775320 hartree
dipole: -3.6884 -5.3578 -0.7238
dipole: 6.5448
quadrupole: -119.0092 -151.4967 -142.0245
quadrupole: 3.2245 1.8227 -5.0306
quadrupole: 18.5009 -13.9866 -4.5144 3.2245 1.8227 -5.0306
hfenergy: -1035.1225198 hartree
pointgroup: C01 [X(C20H24N2O2)]
dipole: 1.5954996 -0.9248253 -1.7970322 debye
polarizability: 354.9167424|11.8184437|165.0802509|35.8158626|17.4240311|228.3109118 unknown
InChI: InChI=1S/C20H24N2O2/c1-16-14-18(24-17-8-4-2-5-9-17)10-11-19(16)21-20(23)15-22-12-6-3-7-13-22/h2,4-5,8-11,14,21H,3,6-7,12-13,15H2,1H3
charge 0 multiplicity 1
48 atoms
O  2.333029 1.510396 3.40704
O  -3.771772 -0.104544 1.286924
N  4.435726 -0.166434 0.874422
N  1.874643 0.1078 1.549182
C  5.822048 -0.872911 -1.625675
C  4.758965 0.248922 -1.572507
C  5.561623 -1.910927 -0.510317
C  4.688991 0.873659 -0.164765
C  5.484151 -1.226011 0.868449
C  4.188772 0.427586 2.211189
C  2.695466 0.759529 2.451364
C  0.458206 0.090264 1.470858
C  -0.148555 -0.658215 0.411802
C  -0.352161 0.777617 2.413839
C  -1.557417 -0.697308 0.327877
C  -2.353852 -0.003751 1.267286
C  -1.755896 0.730555 2.309664
C  0.698906 -1.411305 -0.600017
C  -4.52756 -0.036843 0.092108
C  -4.10947 0.677817 -1.055863
C  -5.79392 -0.663572 0.136122
C  -4.97551 0.751201 -2.170239
C  -6.648015 -0.578457 -0.983912
C  -6.243513 0.125137 -2.143775
H  5.818816 -1.361603 -2.617854
H  6.830272 -0.430527 -1.487255
H  4.986452 1.040522 -2.311424
H  3.766023 -0.169698 -1.832377
H  4.603704 -2.432622 -0.704964
H  6.360597 -2.67625 -0.494189
H  5.646149 1.41166 0.049982
H  3.874586 1.619906 -0.111642
H  5.231553 -1.96568 1.650548
H  6.485669 -0.796541 1.122457
H  4.483621 -0.295603 2.995465
H  4.769434 1.356441 2.397347
H  2.447575 -0.423848 0.865107
H  0.133012 1.341689 3.213118
H  -2.035003 -1.281802 -0.465729
H  -2.39239 1.250256 3.031584
H  1.336445 -2.178091 -0.116711
H  0.062744 -1.928586 -1.336689
H  1.371258 -0.732004 -1.161451
H  -3.136136 1.177704 -1.072594
H  -6.086726 -1.199821 1.04381
H  -4.657577 1.309169 -3.058297
H  -7.629943 -1.063481 -0.950448
H  -6.908623 0.188506 -3.011447
