program: Gaussian 09
title: 000222855
version: EM64L-G09RevD.01
frameworkgroup: C1[X(C12H10N2O3)]
method: RPBEPBE
basis: SDD
operation: Freq
keyword: #p
keyword: freq=noraman
keyword: PBEPBE/SDD
title: #p freq=noraman PBEPBE/SDD
converged: NO YES NO NO
title: Mulliken charges:
elementType: O O O N N C C C C C C C C C C C C H H H H H H H H H H
charge: -0.205278 -0.272035 -0.243280 -0.436532 0.017985 0.253558 0.462665 0.074654 0.314389 -0.488082 -0.359265 -0.353078 -0.431272 -0.243242 -0.242030 0.216122 -0.784471 0.248694 0.324101 0.298408 0.251406 0.363046 0.236341 0.237977 0.248485 0.264514 0.246220
chargesum: 0.00000
title: Mulliken charges with hydrogens summed into heavy atoms:
elementType: O O O N N C C C C C C C C C C C C
charge: -0.205278 -0.272035 -0.243280 -0.073486 0.017985 0.253558 0.462665 0.074654 0.314389 -0.239388 -0.035164 -0.054671 -0.179866 -0.006901 -0.004053 0.216122 -0.025253
polarizability: 2.79718423e+02 -1.18364405e+00 1.84845453e+02 1.28616987e+00 1.19173445e+00 6.58949772e+01
1716.lowfreq: -41.6387 -5.9503 -0.0005 -0.0004 0.0003 2.9874 5.8007 46.2734 49.9549
frequency: -41.5807 46.2632 49.9318 78.0074 96.9638 142.6171 163.6760 206.5109 250.8542 282.5097 313.2366 324.3288 364.4882 393.4669 407.2212 460.5601 494.8086 520.7328 531.2914 544.0224 583.7232 633.9905 650.1215 660.9200 700.5190 740.1689 766.0340 768.7802 777.0455 838.5333 858.7742 881.9950 896.1895 922.5646 967.5056 970.0802 988.4425 999.1918 1014.4408 1024.6614 1036.3245 1051.7100 1127.3442 1147.4297 1175.1818 1182.1311 1229.2135 1242.6444 1260.1931 1288.1589 1313.7442 1335.6480 1380.5815 1384.8300 1403.8678 1430.3710 1448.0539 1463.2143 1463.4779 1509.7089 1534.4211 1571.4200 1608.7586 1622.5451 1638.3673 2993.7053 3078.1733 3130.5224 3138.5945 3141.4171 3143.7310 3166.5425 3172.7179 3191.5194 3217.6065
redmass: 1.0583 9.0911 4.9985 4.1191 6.2819 4.7886 5.1612 4.4632 7.2910 7.7640 5.7928 5.1447 6.4006 8.2126 3.8551 4.4994 3.7416 5.4926 3.7935 5.2285 3.0387 6.2602 5.5562 5.7889 6.7514 8.0480 1.3620 3.6816 5.1469 5.8531 1.3370 4.5707 1.5928 1.1156 4.0014 1.4317 2.4976 1.3467 1.3430 3.2793 1.6833 2.1578 3.5706 2.2491 1.3935 1.1354 3.4699 1.9102 1.9770 2.2509 4.5447 3.9924 1.2517 2.5490 8.1932 3.0048 1.1405 1.6360 1.2056 3.1573 3.1679 3.6798 5.7683 6.0829 4.2914 1.0382 1.0978 1.0874 1.0910 1.0989 1.0912 1.0992 1.0808 1.0955 1.0929
irintensity: 1.1347 4.6388 0.0391 3.2826 3.9143 9.0360 1.2487 1.5319 4.1155 1.9509 0.8623 0.5758 0.2433 0.3262 0.8901 4.7977 18.0971 3.1065 5.6372 16.3105 0.5100 0.0962 6.9888 5.4476 0.6226 5.4281 67.0374 1.2158 3.9321 1.3480 45.0005 2.6118 25.2270 81.3062 16.9661 6.4590 43.8817 0.6542 0.7846 6.3530 13.5677 13.4530 134.3433 151.0092 31.3797 6.7273 126.1926 43.2468 62.6319 12.6615 298.9992 423.4243 64.9661 31.3223 33.9656 28.3747 30.6805 20.3819 29.0536 327.3917 26.3898 262.4174 97.7794 87.1387 93.7576 2.3544 9.3625 0.7447 7.5206 11.4702 17.3090 28.9188 110.0491 23.1866 5.7326
temp: 298.150 k
press: 1.00000 atm
elementType: 8 8 8 7 7 6 6 6 6 6 6 6 6 6 6 6 6 1 1 1 1 1 1 1 1 1 1
symmnumber: 1
zpe: 523599.8 jmol-1
zpe.correction: 0.199429 hartree
zpe.thermalcorrener: 0.212909 hartree
zpe.thermalcorrenthalpy: 0.213853 hartree
zpe.thermalcorrgfe: 0.158435 hartree
zpe.sumelectzpe: -797.206303 hartree
zpe.sumelectthermal: -797.192823 hartree
zpe.sumelectthermalent: -797.191878 hartree
zpe.sumelectthermalfe: -797.247297 hartree
dipole: -1.5501 -2.0432 0.6602
dipole: 2.6483
quadrupole: -80.5220 -107.7419 -101.0027
quadrupole: 11.0506 0.0199 0.8319
quadrupole: 15.9002 -11.3197 -4.5805 11.0506 0.0199 0.8319
hfenergy: -797.4057318 hartree
pointgroup: C01 [X(C12H10N2O3)]
dipole: 0.6018903 0.7961617 0.2990693 debye
polarizability: 279.7362851|-0.2595691|184.6772271|-0.882739|4.4490946|66.0453409 unknown
InChI: InChI=1S/C12H10N2O3/c1-8(15)13-11-7-6-9-4-2-3-5-10(9)12(11)14(16)17/h2-7,13H,1H3
charge 0 multiplicity 1
27 atoms
O  0.640618 -2.912183 -0.631672
O  -1.460914 -2.536569 0.111788
O  -3.615014 1.859875 -0.113872
N  -2.376976 -0.153435 0.03213
N  -0.255461 -2.089553 -0.20016
C  1.431888 -0.217237 -0.037976
C  1.675193 1.212199 -0.000432
C  0.042331 -0.666777 -0.069378
C  -1.045366 0.277689 -0.008623
C  0.568817 2.121581 -0.009798
C  -0.744527 1.682792 -0.008615
C  2.583759 -1.073723 0.006691
C  3.010047 1.723218 0.056397
C  3.878929 -0.543433 0.081675
C  4.107439 0.861912 0.096491
C  -3.566487 0.600963 -0.019967
C  -4.816166 -0.268327 0.059175
H  0.775596 3.198077 -0.003114
H  -1.583613 2.379504 -0.006799
H  2.456279 -2.153716 -0.032142
H  3.151465 2.8099 0.076145
H  -2.449921 -1.189149 0.125909
H  4.730534 -1.231214 0.122217
H  5.127587 1.256033 0.142828
H  -4.856896 -0.981738 -0.7841
H  -5.702132 0.380952 0.025223
H  -4.833611 -0.856042 0.995381
