program: Gaussian 09
title: 000222851
version: EM64L-G09RevD.01
frameworkgroup: C1[X(C10H10O3)]
method: RPBEPBE
basis: SDD
operation: Freq
keyword: #pfreq=noraman
keyword: PBEPBE/SDD
title: #p freq=noraman PBEPBE/SDD
converged: NO YES NO YES
title: Mulliken charges:
elementType: O O O C C C C C C C C C C H H H H H H H H H H
charge: -0.232779 -0.186733 -0.247125 0.285851 0.089405 -0.358811 -0.343330 -0.342662 -0.239553 -0.225615 -0.222341 0.278929 -0.747216 0.255463 0.255477 0.243133 0.278903 0.234322 0.236478 0.236236 0.254160 0.254100 0.243710
chargesum: 0.00000
title: Mulliken charges with hydrogens summed into heavy atoms:
elementType: O O O C C C C C C C C C C
charge: -0.232779 -0.186733 -0.247125 0.285851 0.089405 0.152128 -0.100197 -0.063759 -0.005231 0.010862 0.013895 0.278929 0.004755
polarizability: 1.67121105e+02 -7.56051095e+00 1.21985873e+02 8.84588501e-04 -9.86142182e-04 5.54829994e+01
1716.lowfreq: -23.8527 -4.3411 -0.0008 -0.0002 0.0002 4.1294 9.7624 16.7255 37.1770
frequency: -23.5586 16.3736 37.1621 62.1797 77.6362 151.1606 193.3602 193.7114 234.0483 307.1677 398.5586 409.8950 414.8735 475.7931 562.7681 578.1489 601.0454 612.8935 646.2520 696.1408 765.4952 767.8043 858.7546 875.0367 933.4742 949.2366 979.9872 989.5758 992.0010 992.5557 1013.3174 1025.6780 1044.2678 1046.9650 1089.0369 1174.6976 1191.7837 1201.3820 1210.3095 1230.2407 1318.4371 1343.3806 1385.4904 1388.7858 1437.1875 1449.6145 1452.3202 1452.4041 1481.9143 1579.1064 1604.0432 1621.1330 1652.0937 2984.7845 3011.1052 3040.4927 3098.9773 3130.8081 3138.8883 3146.9862 3149.7707 3159.9371 3170.8640
redmass: 1.0885 6.2792 4.3171 3.5296 5.2150 5.0048 2.5632 4.4468 8.2538 6.3167 2.8242 4.5467 3.3239 4.9022 2.7259 2.8495 6.5449 6.4365 6.1228 1.8289 5.6026 1.6597 1.2499 5.8224 1.4312 5.6420 2.0559 6.1842 2.0601 1.3954 1.3669 2.3024 1.6635 3.5260 1.6264 1.0720 1.1803 2.7239 1.0784 3.5300 1.3609 1.6194 1.2514 9.0343 2.2634 1.1133 1.0462 1.0632 2.1111 6.3830 6.5280 8.1501 9.2138 1.0570 1.0367 1.1026 1.0972 1.0851 1.0880 1.1013 1.0924 1.0961 1.1015
irintensity: 2.7957 2.6282 1.4839 0.6204 3.0594 0.9020 13.9814 11.4639 1.0695 1.0234 0.0403 1.2191 0.4552 13.4714 0.2723 16.2725 17.1781 0.3098 9.0478 51.3984 1.2439 55.8821 0.5365 17.3636 1.4297 93.4963 0.8073 2.2303 100.0254 0.7260 0.5190 5.0945 10.5051 34.5630 12.7391 9.6493 86.4656 415.0591 0.0157 26.4642 1.0705 63.5667 66.1966 1.9522 22.5313 11.3040 18.1501 29.3919 0.2112 59.3555 70.4259 67.8873 140.5464 37.6846 1.6057 9.4199 6.1498 0.8313 5.1112 10.5158 16.9517 17.6544 20.3169
temp: 298.150 k
press: 1.00000 atm
elementType: 8 8 8 6 6 6 6 6 6 6 6 6 6 1 1 1 1 1 1 1 1 1 1
symmnumber: 1
zpe: 461754.3 jmol-1
zpe.correction: 0.175873 hartree
zpe.thermalcorrener: 0.187695 hartree
zpe.thermalcorrenthalpy: 0.188639 hartree
zpe.thermalcorrgfe: 0.135221 hartree
zpe.sumelectzpe: -611.785835 hartree
zpe.sumelectthermal: -611.774013 hartree
zpe.sumelectthermalent: -611.773069 hartree
zpe.sumelectthermalfe: -611.826487 hartree
dipole: -2.1792 1.2286 -0.0003
dipole: 2.5017
quadrupole: -57.9973 -81.7325 -76.6684
quadrupole: -7.4215 0.0051 0.0081
quadrupole: 14.1354 -9.5998 -4.5357 -7.4215 0.0051 0.0081
hfenergy: -611.9617076 hartree
pointgroup: C01 [X(C10H10O3)]
dipole: -0.8522405 -0.4923028 0.0057314 debye
dipolederiv: -1.7205787 0.2621034 -0.0020743 0.3631157 -0.495569 0.0024197 -0.0026819 0.0022349 -0.2659126 -0.7579155 -0.0918042 0.001081 -0.3160112 -0.8104872 0.0057223 0.0035781 0.0059351 -0.292615 -0.7102727 -0.082361 0.0011334 0.3824713 -0.9287113 0.0065463 -0.0041728 0.0073106 -0.3083339 -0.7638383 -0.1769015 0.002136 -0.1124151 -0.1245682 0.0012326 0.00128 0.0011809 -0.0155204 1.7245518 0.1593858 -0.0020423 0.1523564 0.9030076 -0.0087573 -0.0018438 -0.0087779 0.1185277 0.5218848 0.1081962 -0.0015473 0.5330034 -0.0757846 0.0045154 -0.0059972 0.0046657 0.3480906 0.1284209 -0.0613429 0.0005798 0.1146694 0.0120818 -0.001587 -0.0015472 -0.0015657 -0.1366456 0.0276742 0.1441964 -0.0015478 -0.1219311 0.0368707 -0.0013459 0.0012753 -0.0014878 -0.1001382 -0.2588219 0.0504332 -0.000518 0.1211578 0.1419685 -0.0030977 -0.001253 -0.0031023 -0.1510512 0.0163493 -0.1967333 0.0020322 -0.1902818 -0.0584213 -0.0009441 0.0019895 -0.0009599 -0.1533181 0.1379827 0.0457025 -0.0005429 0.0118337 0.033701 -0.0017495 -0.0002117 -0.0017286 -0.1323128 1.8765508 -0.0946705 0.0000154 -0.6945894 1.2760587 -0.0115786 0.0064266 -0.0121221 0.1964208 -0.3183454 -0.1596781 0.002117 -0.2342973 -0.1721426 0.0023006 0.0030199 0.0022938 0.0197428 -0.0433606 -0.0072582 -0.0192544 -0.1120246 0.0398851 -0.0639018 -0.0609305 -0.0607185 -0.0122362 -0.0434513 -0.0066701 0.0194138 -0.1104964 0.0427387 0.0627767 0.0634357 0.059487 -0.0152686 -0.0122218 0.1009081 -0.000997 0.1218849 0.0279266 0.001172 -0.0011788 0.001166 0.143455 0.1341392 -0.0451278 0.0004627 0.0056148 -0.0028771 0.0016202 -0.0001181 0.0016674 0.1543892 0.0679882 -0.0322172 0.0003734 -0.0562999 -0.1038991 0.002787 0.0006604 0.0027716 0.1602318 -0.048354 0.090719 -0.0008934 0.1044168 0.006037 0.0015769 -0.0010348 0.0015814 0.1589632 -0.0986637 -0.0638601 0.0007365 -0.0651735 0.0733221 0.000901 0.0007382 0.0009019 0.1579494 0.0978022 0.0021855 0.0319275 0.0001755 0.0722191 -0.0896345 -0.0068913 -0.0978755 0.0008335 0.0978725 0.0012484 -0.0318378 0.0000952 0.0768529 0.0877216 0.0069488 0.0959455 -0.0040099 -0.0553924 0.0535462 -0.0007534 0.1027256 0.0297907 0.001304 -0.0014915 0.0011964 0.1287585 unknown
polarizability: 166.9573931|8.0316969|122.1417268|-0.1287842|-0.7230191|55.4908574 unknown
InChI: InChI=1S/C10H10O3/c1-8(11)13-7-10(12)9-5-3-2-4-6-9/h2-6H,7H2,1H3
charge 0 multiplicity 1
23 atoms
O  2.481804 0.453698 -0.010303
O  0.283996 2.010189 -0.026625
O  3.552405 -1.61778 0.01236
C  -1.339575 0.221078 -0.006064
C  0.059583 0.770629 -0.01214
C  1.197319 -0.258352 -0.001204
C  -1.621568 -1.172892 0.00859
C  -2.418184 1.147109 -0.015513
C  -2.957447 -1.627354 0.013713
C  -3.750411 0.691733 -0.010396
C  -4.023544 -0.697899 0.004246
C  3.621083 -0.367984 -0.002248
C  4.872018 0.478143 -0.012009
H  1.132789 -0.923284 -0.88442
H  1.133959 -0.902603 0.897316
H  -0.811475 -1.91046 0.016004
H  -2.17878 2.2157 -0.026784
H  -3.168428 -2.702057 0.025037
H  -4.575477 1.412003 -0.017749
H  -5.059773 -1.053795 0.008222
H  4.884048 1.145057 0.867158
H  4.885258 1.122549 -0.90781
H  5.759099 -0.170626 -0.003278
