program: Gaussian 09
title: 000217721
version: EM64L-G09RevD.01
frameworkgroup: C1[X(C19H24N2O2)]
method: RPBEPBE
basis: SDD
operation: Freq
keyword: #p
keyword: freq=noraman
keyword: PBEPBE/SDD
title: #p freq=noraman PBEPBE/SDD
converged: YES YES NO NO
title: Mulliken charges:
elementType: O O N N C C C C C C C C C C C C C C C C C C C H H H H H H H H H H H H H H H H H H H H H H H H
charge: -0.308660 -0.259723 -0.392306 -0.461596 -0.357871 -0.356031 -0.341237 -0.500306 0.308567 0.313649 -0.686685 0.166580 -0.330710 -0.546142 0.341143 -0.415690 -0.845844 0.343793 -0.356187 -0.386155 -0.209234 -0.194643 -0.255701 0.201451 0.181490 0.221928 0.201409 0.198066 0.195319 0.273330 0.235855 0.246073 0.209372 0.210987 0.220592 0.398546 0.307652 0.268584 0.256668 0.241366 0.226736 0.234668 0.264638 0.255993 0.224778 0.227703 0.227784
chargesum: 0.00000
title: Mulliken charges with hydrogens summed into heavy atoms:
elementType: O O N N C C C C C C C C C C C C C C C C C C C
charge: -0.308660 -0.259723 -0.118976 -0.063050 0.025070 0.067306 0.052148 -0.018378 0.308567 0.313649 -0.045734 0.166580 -0.023058 -0.277557 0.341143 -0.159022 -0.143074 0.343793 -0.091549 -0.130162 0.015545 0.033060 -0.027917
polarizability: 3.38093366e+02 -3.52187693e+01 2.32084556e+02 -8.20491959e+00 9.97644080e+00 1.51476035e+02
1716.lowfreq: -12.1416 -6.5031 -4.7666 -0.0008 -0.0007 -0.0003 8.5325 12.8147 23.3039
frequency: 7.4102 12.4571 23.2045 33.1559 38.5319 48.4279 68.5865 86.5269 90.9690 112.5289 125.8324 145.9224 179.3758 187.7652 200.0029 205.2096 224.5666 233.8477 263.3268 288.7992 306.2960 329.2405 345.7572 372.6878 411.1733 430.4111 443.5959 448.9999 477.1919 496.7179 531.0478 539.2470 564.8677 575.4887 606.1001 609.4907 640.5897 690.0087 698.4035 710.5164 731.1442 732.7803 759.6061 797.8171 805.2998 832.0437 834.1760 849.8687 880.4121 890.5193 898.3594 903.5637 906.3522 927.1127 938.0812 954.1964 966.3697 980.2525 984.0097 985.5770 998.3830 1019.0822 1030.6336 1034.8908 1042.4199 1077.4980 1078.7310 1105.4286 1119.6030 1128.1874 1142.2479 1146.8528 1166.4606 1171.5341 1187.9234 1196.9148 1212.0081 1212.2751 1233.0921 1270.6781 1276.8485 1279.1345 1283.6554 1288.3835 1308.1058 1320.1682 1338.8536 1367.6077 1370.1967 1386.2923 1391.3173 1398.8022 1416.3969 1440.4088 1442.3011 1448.4079 1457.1121 1464.6927 1470.3596 1472.4953 1477.4698 1478.4178 1484.5873 1491.6927 1495.2011 1520.5708 1589.6749 1595.9175 1607.0929 1619.6138 1626.7828 2899.7615 2955.8416 2960.2646 2962.9125 2971.7897 2974.6579 2999.2103 3011.9848 3030.4716 3036.0285 3042.8161 3071.0332 3076.3596 3089.6661 3127.9305 3137.6015 3144.8518 3155.2819 3163.9276 3164.1871 3173.0719 3186.1152 3280.7607 3461.7930
redmass: 4.1379 4.4142 3.6041 1.7908 3.9198 4.1781 5.3677 4.7977 3.3416 4.0458 2.0417 3.0589 1.3820 2.9037 4.0257 4.2641 2.6932 1.1326 3.8437 2.7758 4.9846 6.0676 3.7247 5.3921 2.9391 3.1792 3.5481 3.1439 3.9040 3.6131 5.1132 4.2234 4.0015 4.5983 5.0645 4.4245 3.8584 2.6453 2.8938 1.9026 3.4336 1.0970 1.6420 1.4324 2.9960 1.5127 2.5494 1.4073 1.4133 2.4140 1.1849 1.4690 2.1642 1.9395 1.5675 3.8020 1.3606 1.3174 1.2975 5.9092 1.5900 2.0795 3.1672 2.1688 1.5227 1.5015 2.2929 1.7473 2.2917 3.2710 1.5834 1.7640 1.1408 1.1681 2.9812 2.2480 1.3523 2.6550 1.2906 1.2930 1.2050 1.3652 1.0963 2.8261 1.3454 1.3802 1.4342 1.5071 5.8330 7.5369 1.2160 1.3147 3.2788 1.2226 2.3337 1.1221 1.6984 1.0937 2.2561 1.0667 1.0474 1.0424 1.0689 1.3041 1.2029 2.3504 6.4550 6.4076 6.7243 6.1754 7.5069 1.0694 1.0610 1.0397 1.0637 1.0597 1.0365 1.0909 1.0970 1.0969 1.1029 1.0976 1.1009 1.0993 1.0961 1.0849 1.0892 1.0917 1.0930 1.0906 1.0955 1.1002 1.0961 1.0760 1.0756
irintensity: 0.3030 0.7484 0.3314 0.8107 0.5630 1.8260 3.5312 2.0991 0.0375 0.4685 0.3108 3.6035 0.5048 2.1668 2.5999 5.3089 0.9716 0.1194 2.8943 1.6938 3.0674 28.2728 0.4308 0.8601 0.5960 2.0521 0.6210 7.5290 33.2555 4.2083 3.1428 7.5130 4.4958 1.2833 1.8509 2.7905 5.4006 30.4924 11.7699 54.8309 5.9097 10.7228 85.3821 7.3846 6.5881 2.3213 10.0234 45.9367 21.3026 2.2112 66.1308 4.9428 10.2305 12.0741 19.7076 34.6581 0.4171 2.0109 0.7098 0.4263 29.0969 17.3027 2.1420 9.4141 7.6585 11.6689 2.0356 9.1834 11.9017 31.6449 10.3385 5.5999 38.1144 57.2886 14.3955 79.4904 0.7066 313.7948 4.9489 20.5760 3.5308 62.1644 0.8087 44.1092 0.5726 8.2760 1.1672 16.2727 39.3572 0.0755 12.7856 11.7018 26.4052 12.5952 4.3059 52.6014 84.4710 2.2070 225.9377 2.0424 14.4654 12.2808 7.9638 41.9232 53.7038 685.5779 12.7136 29.5291 83.6125 30.9589 220.4052 80.8652 16.1614 32.7656 52.1520 56.2627 31.1619 9.6059 5.1012 21.9326 68.6461 13.5036 86.9544 49.1901 18.5180 2.3565 12.7586 11.1325 30.6702 2.5342 15.4118 9.2868 7.4285 274.1009 0.6495
temp: 298.150 k
press: 1.00000 atm
elementType: 8 8 7 7 6 6 6 6 6 6 6 6 6 6 6 6 6 6 6 6 6 6 6 1 1 1 1 1 1 1 1 1 1 1 1 1 1 1 1 1 1 1 1 1 1 1 1
symmnumber: 1
zpe: 1026536.8 jmol-1
zpe.correction: 0.390987 hartree
zpe.thermalcorrener: 0.414231 hartree
zpe.thermalcorrenthalpy: 0.415175 hartree
zpe.thermalcorrgfe: 0.333230 hartree
zpe.sumelectzpe: -996.676288 hartree
zpe.sumelectthermal: -996.653045 hartree
zpe.sumelectthermalent: -996.652101 hartree
zpe.sumelectthermalfe: -996.734045 hartree
dipole: 4.0039 4.7600 2.1297
dipole: 6.5745
quadrupole: -112.2401 -146.4838 -138.8515
quadrupole: 0.9432 4.8819 -6.6317
quadrupole: 20.2850 -13.9586 -6.3264 0.9432 4.8819 -6.6317
hfenergy: -997.0672753 hartree
pointgroup: C01 [X(C19H24N2O2)]
dipole: 1.8427046 0.0500421 -1.8145408 debye
polarizability: 325.8424985|9.1427206|158.1139643|48.6437281|26.0453119|237.6974936 unknown
InChI: InChI=1S/C19H24N2O2/c1-3-4-12-20-14-19(22)21-18-11-10-17(13-15(18)2)23-16-8-6-5-7-9-16/h5-11,13,20-21H,3-4,12,14H2,1-2H3
charge 0 multiplicity 1
47 atoms
O  -3.417116 0.303303 0.884966
O  2.395155 0.353479 4.150075
N  4.753278 0.828076 1.35537
N  2.145048 0.740844 1.822722
C  5.467956 -0.504109 -0.637766
C  5.156626 -0.518736 0.870454
C  5.914438 -1.886569 -1.167094
C  4.370062 0.888484 2.784204
C  0.751397 0.604993 1.595582
C  0.267282 0.783842 0.259856
C  6.223263 -1.873565 -2.679586
C  2.859184 0.618889 2.999946
C  -0.154074 0.308383 2.649327
C  -1.117099 0.652263 0.016405
C  -2.00747 0.343347 1.069756
C  -1.531446 0.176196 2.384297
C  1.214083 1.124737 -0.878611
C  -3.985345 -0.35845 -0.230065
C  -3.366449 -1.448856 -0.88686
C  -5.272998 0.082899 -0.611718
C  -4.051061 -2.090304 -1.943565
C  -5.944398 -0.570307 -1.66723
C  -5.337051 -1.656622 -2.341599
H  4.57038 -0.16153 -1.191076
H  6.267768 0.239046 -0.844241
H  4.31947 -1.215539 1.072418
H  6.039432 -0.910022 1.430153
H  5.120913 -2.631862 -0.956802
H  6.811893 -2.220418 -0.608019
H  5.446516 1.541925 1.099148
H  4.922285 0.16778 3.423287
H  4.577217 1.898884 3.184076
H  7.036667 -1.160929 -2.913184
H  5.334065 -1.571202 -3.264034
H  6.537074 -2.871834 -3.034846
H  2.788124 0.951417 1.035017
H  0.238206 0.183359 3.660784
H  -1.504003 0.802471 -0.997153
H  -2.240464 -0.048874 3.186191
H  0.664187 1.222865 -1.828804
H  1.987441 0.343755 -1.024228
H  1.743707 2.081628 -0.702127
H  -2.378301 -1.797147 -0.571108
H  -5.724145 0.92313 -0.075327
H  -3.57712 -2.938492 -2.450577
H  -6.942448 -0.228672 -1.963391
H  -5.860332 -2.160253 -3.161225
