program: Gaussian 09
title: 000222854
version: EM64L-G09RevD.01
frameworkgroup: C1[X(C14H13ClO)]
method: RPBEPBE
basis: SDD
operation: Freq
keyword: #p
keyword: freq=noraman
keyword: PBEPBE/SDD
title: #p freq=noraman PBEPBE/SDD
converged: YES YES NO NO
title: Mulliken charges:
elementType: Cl O C C C C C C C C C C C C C C H H H H H H H H H H H H H
charge: -0.062718 -0.442548 -0.612363 0.310879 0.549158 -0.468340 0.122099 0.457582 -0.386722 -0.417579 -0.314530 -0.392821 -0.820113 -0.234461 -0.240741 -0.229146 0.256306 0.237925 0.244386 0.214924 0.230180 0.244263 0.231777 0.220156 0.227765 0.254770 0.230921 0.232898 0.356094
chargesum: 0.00000
title: Mulliken charges with hydrogens summed into heavy atoms:
elementType: Cl O C C C C C C C C C C C C C C
charge: -0.062718 -0.086454 -0.118132 0.310879 0.549158 -0.223955 0.122099 0.457582 -0.171799 -0.187398 -0.314530 -0.148558 -0.140415 0.020309 -0.009820 0.003752
polarizability: 1.90367593e+02 -2.31666893e+01 1.51116629e+02 8.54150176e+00 7.50772587e-01 1.31035428e+02
1716.lowfreq: -10.2700 -9.1185 -2.0987 -0.0009 -0.0006 -0.0006 3.3587 25.3508 55.4250
frequency: -6.8605 25.3376 55.3800 58.9245 132.3409 136.5525 161.4449 186.1298 244.0302 261.2243 310.8318 333.7548 351.8960 363.0466 414.2570 432.6530 433.4544 456.2610 470.4636 499.2095 554.5207 578.2099 607.8133 663.0695 701.2232 709.5692 725.7641 756.1368 787.9524 796.6914 829.6966 869.9960 882.4929 917.1308 926.7626 943.0028 949.0452 984.3786 1003.0990 1019.1750 1038.5350 1047.9622 1076.9426 1121.0637 1155.7426 1160.8584 1169.7023 1188.7945 1212.1537 1226.4849 1253.1043 1278.8997 1293.3124 1324.5047 1374.3766 1385.7681 1399.1161 1418.6691 1425.0673 1455.8987 1465.4217 1470.5197 1478.1467 1501.2564 1574.6219 1605.2725 1609.2236 1623.0080 2973.4391 2990.1531 3039.1681 3050.5369 3080.1564 3108.2943 3126.6350 3129.6565 3139.4476 3140.8659 3158.0130 3173.2749 3583.0554
redmass: 4.9299 6.9782 1.1495 3.3157 4.4013 4.5572 4.3394 5.4685 4.3405 3.7630 3.2241 3.1485 2.9557 1.3595 3.8556 3.2616 3.6933 4.5098 4.3953 4.4884 3.0565 5.0176 4.6340 6.2537 5.6007 3.3713 4.4712 1.3421 3.8624 1.4144 3.5114 1.5260 1.4154 1.4699 3.0502 1.5385 1.4396 1.3265 1.5604 6.8972 2.1234 1.5334 2.4255 1.6625 1.4818 1.3202 1.0656 1.1151 2.1366 1.8253 2.7342 1.4064 1.8692 1.4871 7.6191 3.7072 1.3519 2.9183 2.2731 1.1962 2.4739 1.0458 1.1583 2.6760 6.1252 6.9565 6.6654 6.4231 1.0371 1.0615 1.0980 1.0978 1.0986 1.0878 1.0871 1.0911 1.0960 1.0896 1.0949 1.0997 1.0659
irintensity: 0.6469 0.4923 0.4461 0.4710 0.0162 0.1703 4.9232 2.3655 3.1314 4.1525 0.9397 5.2755 9.9261 115.6467 3.1299 5.1585 2.7306 5.6379 9.9248 1.2585 9.8709 7.4565 3.1541 16.7063 6.7654 0.1694 6.8364 58.4422 30.3371 47.9754 6.2802 1.9365 0.6002 1.4482 5.5367 2.8829 3.2865 0.0290 4.9269 52.5973 2.9622 11.4157 118.7071 4.6776 12.1907 98.9275 0.3194 1.3378 0.8312 6.3769 57.0463 0.9204 3.1203 5.8238 1.6730 6.8172 14.9199 3.9609 19.4864 21.8383 36.6068 13.4441 16.6632 71.1353 9.4334 0.4604 1.0395 13.3850 40.4601 12.0042 3.3051 21.2844 22.2148 19.3544 4.7891 12.3403 20.1729 10.3925 17.3143 14.7517 30.3721
temp: 298.150 k
press: 1.00000 atm
elementType: 17 8 6 6 6 6 6 6 6 6 6 6 6 6 6 6 1 1 1 1 1 1 1 1 1 1 1 1 1
symmnumber: 1
zpe: 595501.3 jmol-1
zpe.correction: 0.226814 hartree
zpe.thermalcorrener: 0.240817 hartree
zpe.thermalcorrenthalpy: 0.241761 hartree
zpe.thermalcorrgfe: 0.184936 hartree
zpe.sumelectzpe: -1075.440808 hartree
zpe.sumelectthermal: -1075.426805 hartree
zpe.sumelectthermalent: -1075.425861 hartree
zpe.sumelectthermalfe: -1075.482687 hartree
dipole: 0.8931 1.0002 -1.3187
dipole: 1.8807
quadrupole: -82.2854 -96.2573 -101.0211
quadrupole: -9.9921 1.6578 1.7158
quadrupole: 10.9025 -3.0694 -7.8332 -9.9921 1.6578 1.7158
hfenergy: -1075.6676226 hartree
pointgroup: C01 [X(C14H13Cl1O1)]
dipole: 0.3608151 0.4552285 -0.4583476 debye
polarizability: 185.3639794|-27.5006295|155.2328355|-0.6341025|6.8090506|131.922836 unknown
InChI: InChI=1S/C14H13ClO/c1-10-6-7-14(16)12(8-10)9-11-4-2-3-5-13(11)15/h2-8,16H,9H2,1H3
charge 0 multiplicity 1
29 atoms
Cl -1.501221 -1.413789 2.104719
O  1.92252 -2.534809 -1.324613
C  -0.365526 -1.044772 -0.829747
C  1.005229 -0.497895 -0.427151
C  -1.54775 -0.184339 -0.427011
C  1.201057 0.753574 0.193103
C  2.154525 -1.290241 -0.695978
C  2.489114 1.234305 0.552372
C  3.446689 -0.842271 -0.352172
C  3.608051 0.416955 0.270545
C  -2.155459 -0.249409 0.850277
C  -2.108819 0.74476 -1.344503
C  2.648855 2.587417 1.225462
C  -3.257708 0.546286 1.220149
C  -3.211071 1.55868 -1.004533
C  -3.789062 1.459369 0.281747
H  -0.467654 -2.058997 -0.400174
H  -0.375161 -1.186833 -1.92766
H  0.323185 1.37392 0.409278
H  4.324388 -1.466963 -0.565661
H  4.614314 0.760486 0.537367
H  -1.660744 0.820745 -2.342332
H  2.112188 2.622374 2.192452
H  3.710404 2.8167 1.422942
H  2.239867 3.402441 0.598752
H  -3.690962 0.450914 2.220083
H  -3.618331 2.262097 -1.738508
H  -4.647009 2.081625 0.557795
H  2.772091 -3.026032 -1.447402
