program: Gaussian 09
title: 000217715
version: EM64L-G09RevD.01
frameworkgroup: C1[X(C20H30N2O)]
method: RPBEPBE
basis: SDD
operation: Freq
keyword: #p
keyword: freq=noraman
keyword: PBEPBE/SDD
title: #p freq=noraman PBEPBE/SDD
converged: YES YES NO NO
title: Mulliken charges:
elementType: O N N C C C C C C C C C C C C C C C C C C C C H H H H H H H H H H H H H H H H H H H H H H H H H H H H H H
charge: -0.249748 -0.110474 -0.480081 -0.026783 -0.117397 -0.460112 -0.478674 -0.446875 -0.409167 -0.391220 -0.406414 -0.368198 -0.334337 -0.586021 0.212924 0.151828 0.339978 0.366292 -0.422944 -0.413463 -0.836377 -0.822747 -0.233263 0.206133 0.210372 0.192860 0.197558 0.209174 0.203098 0.219537 0.203823 0.201617 0.198499 0.188601 0.199493 0.189380 0.201845 0.183242 0.192472 0.204990 0.227404 0.238120 0.236932 0.306860 0.231622 0.232029 0.236655 0.220979 0.244660 0.215992 0.217417 0.287009 0.224899
chargesum: 0.00000
title: Mulliken charges with hydrogens summed into heavy atoms:
elementType: O N N C C C C C C C C C C C C C C C C C C C C
charge: -0.249748 -0.110474 -0.173221 0.179350 0.092975 -0.069694 -0.066403 -0.023515 -0.009051 -0.003125 -0.015189 0.007516 0.098057 -0.110970 0.212924 0.151828 0.339978 0.366292 -0.191321 -0.181434 -0.134083 -0.102328 -0.008364
polarizability: 2.99376069e+02 4.25865489e+00 2.10838816e+02 7.66046917e+00 -9.51977580e+00 1.80292438e+02
1716.lowfreq: -18.3348 -10.2550 -3.8731 -0.7685 -0.0008 -0.0006 0.0010 16.8940 32.0534
frequency: -16.2409 15.8875 30.9059 55.5102 70.0513 83.3937 89.4039 123.5664 139.4945 149.4074 156.6853 167.9096 177.5000 187.8251 213.9727 232.7399 271.1297 283.6855 292.1515 308.5831 316.5010 322.5808 348.7391 356.7656 372.4476 426.6465 447.1782 462.3142 476.9407 511.8516 515.7477 517.2290 529.1360 540.3343 572.4624 576.8646 597.6014 600.6488 668.2769 710.9755 744.4587 757.6405 777.4796 785.9323 795.5029 809.6281 834.9259 841.4925 843.3138 879.5192 893.9553 898.5401 909.1442 916.4021 945.9259 948.1775 974.7430 980.0185 985.6434 986.9892 1020.4792 1037.9750 1038.7310 1044.3374 1048.2740 1051.9139 1053.1317 1065.4452 1078.1973 1097.2581 1103.9603 1109.0273 1124.6473 1129.3291 1156.6841 1165.8047 1175.6611 1177.2724 1186.9329 1213.5917 1228.4045 1237.4957 1249.2354 1255.3319 1260.2470 1271.0005 1278.7944 1285.7307 1289.7440 1299.3317 1311.8865 1321.1663 1324.9740 1334.7611 1340.5235 1342.0015 1345.8855 1360.4918 1362.6180 1367.2576 1368.4638 1385.4255 1396.0371 1397.9241 1433.7941 1441.9214 1449.2397 1454.9014 1456.9140 1460.9848 1463.2249 1470.0216 1470.1157 1470.4980 1471.2749 1475.8340 1481.9773 1486.0211 1489.5492 1492.0093 1603.2992 1604.8633 1630.1694 2844.8166 2912.7769 2949.1144 2954.9921 2959.2435 2961.9487 2971.4346 2974.5060 2976.0400 2977.3549 2977.9961 2979.8449 2983.3877 3014.9410 3016.7185 3023.1700 3023.4829 3027.7989 3031.5855 3038.0697 3041.1383 3048.6369 3050.0479 3059.2633 3087.0067 3088.6130 3121.1346 3131.2551 3156.5302 3507.0701
redmass: 4.1461 3.9506 4.0371 3.6982 3.9746 4.3385 2.4480 3.4926 3.8804 2.1600 1.2576 2.7004 1.9950 1.3598 3.2496 2.4727 2.1199 3.6223 2.3025 3.2204 3.1720 2.0640 3.1182 2.7842 2.3985 3.1746 2.5470 2.8519 3.1155 3.6642 3.1106 3.5923 3.7420 2.8044 2.0809 3.1980 1.5818 2.2095 4.6185 3.7751 2.5991 3.6077 1.2300 1.5462 1.5255 2.7918 4.2994 1.8284 2.3966 1.5240 2.0170 1.3107 3.1659 2.1137 3.0833 2.1059 1.3509 1.9048 2.2333 1.6336 1.7205 2.0154 1.7020 1.6831 1.9311 1.6028 1.7545 2.3209 1.8144 1.6989 1.6271 1.4344 2.6774 1.9371 2.2320 2.0553 1.4477 1.1669 1.5562 1.6695 2.5564 1.5522 1.3123 1.3871 1.6825 1.2736 2.4450 1.1858 1.5828 1.3462 1.3328 1.4615 1.4796 1.3816 1.4224 1.3933 1.4416 1.4168 1.4547 1.4810 5.2969 1.4672 1.2401 1.2662 1.7680 1.3096 1.5767 1.0910 1.2449 1.0868 1.0896 1.2296 1.0861 1.2318 1.0980 1.0902 1.0913 1.2904 1.0852 1.4106 6.2234 6.2662 5.7821 1.0714 1.0694 1.0816 1.0659 1.0425 1.0623 1.0635 1.0636 1.0599 1.0749 1.0363 1.0612 1.0621 1.0990 1.0872 1.0954 1.0950 1.0992 1.1026 1.0919 1.1032 1.1023 1.0956 1.0968 1.0997 1.0980 1.0856 1.0918 1.0995 1.0758
irintensity: 0.7851 0.1303 0.4011 0.3431 0.6868 5.1620 0.9688 1.0710 2.3398 0.0454 0.4084 0.3336 2.0135 1.5858 11.5964 5.5313 0.9780 1.8636 1.1765 4.6761 2.3094 0.4021 1.6712 0.8260 2.7551 8.9038 3.0831 2.8855 0.0372 0.9509 0.1567 6.2370 7.2637 3.4676 13.4101 2.6622 65.9216 2.6638 6.4727 10.8742 0.6930 1.8959 51.6102 12.8352 5.2542 3.3254 3.6562 7.8024 4.3725 5.3299 1.8313 0.1302 4.8814 1.4367 8.5897 4.8599 0.2438 4.6742 14.3612 3.2500 4.1964 0.5055 5.9575 4.1508 13.4094 8.9349 16.1881 2.5405 24.9027 26.0346 31.1286 1.4502 11.5921 25.6039 63.3367 10.4960 9.3340 2.1552 4.8480 1.6996 23.5304 16.1548 3.4112 10.7521 6.3560 1.3357 8.4356 2.1916 49.3389 11.3308 3.7762 9.1509 0.0387 1.9686 0.8482 15.2193 1.0851 12.0746 10.7265 0.3336 60.8470 6.0999 41.9857 1.5962 67.0724 27.4424 89.6293 9.0629 16.7645 1.4442 14.3002 64.7921 10.9669 106.1318 15.2482 5.8771 14.3155 29.9413 5.3678 86.5596 11.1430 3.0683 107.7403 78.4529 44.4606 24.9804 16.7747 35.0732 40.4643 15.2983 65.2922 20.4272 54.2377 26.1060 17.8205 45.2314 45.7590 72.1034 61.5558 24.9841 55.8357 29.8917 19.9523 44.4092 79.1878 73.6344 11.9874 22.8209 22.8364 0.3961 25.9259 35.8729 12.9707
temp: 298.150 k
press: 1.00000 atm
elementType: 8 7 7 6 6 6 6 6 6 6 6 6 6 6 6 6 6 6 6 6 6 6 6 1 1 1 1 1 1 1 1 1 1 1 1 1 1 1 1 1 1 1 1 1 1 1 1 1 1 1 1 1 1
symmnumber: 1
zpe: 1216126.0 jmol-1
zpe.correction: 0.463198 hartree
zpe.thermalcorrener: 0.485087 hartree
zpe.thermalcorrenthalpy: 0.486031 hartree
zpe.thermalcorrgfe: 0.412012 hartree
zpe.sumelectzpe: -963.104963 hartree
zpe.sumelectthermal: -963.083074 hartree
zpe.sumelectthermalent: -963.082130 hartree
zpe.sumelectthermalfe: -963.156149 hartree
dipole: 0.5600 2.5306 1.5822
dipole: 3.0366
quadrupole: -131.5208 -137.4328 -139.7330
quadrupole: -6.7406 -0.9300 -4.5711
quadrupole: 4.7081 -1.2039 -3.5041 -6.7406 -0.9300 -4.5711
hfenergy: -963.568161 hartree
pointgroup: C01 [X(C20H30N2O1)]
dipole: 0.2209676 0.4456315 -1.0862112 debye
polarizability: 299.2006901|8.5920922|184.6731499|-5.0682712|14.1004608|206.6334823 unknown
InChI: InChI=1S/C20H30N2O/c1-15-7-5-8-16(2)20(15)21-19(23)12-14-22-13-6-10-17-9-3-4-11-18(17)22/h5,7-8,17-18,21H,3-4,6,9-14H2,1-2H3
charge 0 multiplicity 1
53 atoms
O  -1.49534 -0.338214 1.402353
N  2.377214 0.456965 -0.33827
N  -2.562962 0.296617 -0.585696
C  4.714966 -0.186541 -0.927205
C  3.519549 -0.430838 0.039382
C  5.900403 -1.125836 -0.580782
C  5.11263 1.31143 -0.957351
C  3.957594 -0.339403 1.53437
C  6.327273 -1.047734 0.905335
C  5.121999 -1.312878 1.837249
C  3.888675 2.186164 -1.307823
C  2.718871 1.900208 -0.344324
C  1.118253 0.150402 0.381905
C  -0.119308 0.500356 -0.469927
C  -1.434392 0.108868 0.220245
C  -3.93028 0.011358 -0.236723
C  -4.670002 -0.846194 -1.106603
C  -4.534533 0.60881 0.907971
C  -6.025338 -1.114088 -0.806377
C  -5.890865 0.297291 1.180725
C  -4.011774 -1.472156 -2.32435
C  -3.78504 1.573263 1.802422
C  -6.634286 -0.554673 0.338285
H  4.352154 -0.442011 -1.944947
H  3.169975 -1.472106 -0.130597
H  6.760674 -0.890133 -1.239378
H  5.606056 -2.172184 -0.80698
H  5.920006 1.463012 -1.700678
H  5.522334 1.627274 0.022482
H  3.092666 -0.570688 2.185877
H  4.273993 0.693558 1.780098
H  6.749636 -0.046999 1.127322
H  7.133168 -1.781296 1.102387
H  4.772701 -2.356969 1.6916
H  5.426234 -1.224966 2.898503
H  4.15008 3.261405 -1.262035
H  3.560229 1.962335 -2.341614
H  2.978562 2.277824 0.678579
H  1.827729 2.468758 -0.670435
H  1.040973 0.66956 1.365205
H  1.095171 -0.93213 0.602725
H  -0.029962 -0.012382 -1.448469
H  -0.142625 1.586706 -0.687637
H  -2.380245 0.521482 -1.567579
H  -6.598699 -1.775203 -1.46675
H  -6.366768 0.746215 2.060404
H  -4.683664 -2.208745 -2.795667
H  -3.761092 -0.720445 -3.100948
H  -3.07203 -1.988811 -2.054134
H  -3.189027 2.29167 1.208821
H  -4.483945 2.142159 2.439033
H  -3.071267 1.029968 2.448057
H  -7.682625 -0.776032 0.567043
