program: Gaussian 09
title: 000222939
version: EM64L-G09RevD.01
frameworkgroup: C1[X(C23H28ClN3)]
method: RPBEPBE
basis: SDD
operation: Freq
keyword: #p
keyword: freq=noraman
keyword: PBEPBE/SDD
title: #p freq=noraman PBEPBE/SDD
converged: YES YES NO NO
title: Mulliken charges:
elementType: Cl N N N C C C C C C C C C C C C C C C C C C C C C C C H H H H H H H H H H H H H H H H H H H H H H H H H H H H
charge: -0.062948 -0.111561 -0.373507 -0.049351 -0.167699 -0.452450 -0.387815 -0.520181 0.499793 -0.319510 -0.316386 -0.424291 -0.421121 0.368513 -0.672277 -0.675531 0.269635 -0.236938 -0.242836 -0.247351 -0.308541 -0.029889 -0.336978 -0.396455 -0.295195 -0.274644 -0.090937 0.266325 0.206452 0.191165 0.195364 0.221688 0.228541 0.222938 0.203589 0.191486 0.203037 0.189347 0.305973 0.241664 0.229128 0.212744 0.217235 0.208978 0.224742 0.220206 0.207121 0.231967 0.225148 0.230973 0.227799 0.199776 0.232822 0.285820 0.254425
chargesum: 0.00000
title: Mulliken charges with hydrogens summed into heavy atoms:
elementType: Cl N N N C C C C C C C C C C C C C C C C C C C C C C C
charge: -0.062948 -0.111561 -0.067534 -0.049351 0.098626 -0.054833 0.029237 -0.068702 0.499793 0.075566 0.075999 -0.182628 -0.191993 0.368513 -0.033320 -0.023462 0.269635 -0.004972 -0.017689 -0.016378 -0.080742 -0.029889 -0.137202 -0.163633 -0.009376 -0.020219 -0.090937
polarizability: 3.38072348e+02 -1.90321271e+01 3.01805576e+02 -4.67530474e+01 -1.18391654e+01 2.08942853e+02
1716.lowfreq: -4.9191 -0.0014 -0.0008 0.0007 5.2654 6.4709 11.9218 16.3971 17.1673
frequency: 9.8181 16.1678 16.9584 27.0860 31.0894 47.4206 61.7565 67.6052 84.3822 87.8400 95.0687 123.8879 146.3060 163.3094 172.7936 202.3921 211.1768 223.1541 238.3608 247.3845 278.8483 288.1942 294.5500 301.2209 329.9506 344.4450 389.8014 403.7864 406.6620 423.2780 435.9801 444.6395 449.8711 458.4936 485.2837 500.6911 506.5868 540.3266 557.0790 564.3634 578.6747 616.6851 617.4652 635.2387 643.3580 701.9763 709.2238 718.7681 742.8588 759.2574 771.8601 789.6234 795.9839 808.0802 819.3260 827.7703 855.3512 859.3218 870.4055 896.5538 898.1767 918.0507 927.7924 933.3831 948.1073 957.0773 978.8379 989.6468 990.7219 996.8535 1011.2052 1024.7625 1029.1278 1055.4908 1060.7822 1063.4041 1072.4966 1079.7803 1083.4699 1094.1521 1101.7826 1112.5278 1134.3367 1150.6628 1171.3757 1172.4759 1189.2459 1194.8812 1205.3171 1210.7462 1217.1526 1229.8529 1249.4914 1259.9875 1282.8036 1291.0305 1296.1282 1310.9587 1314.9224 1335.8972 1341.6909 1350.5975 1360.2177 1360.8060 1367.1083 1371.7194 1376.2745 1386.3636 1388.3470 1390.8194 1392.0212 1417.4148 1440.8572 1443.9603 1459.0627 1461.4796 1463.7234 1470.6038 1471.8982 1476.7239 1480.3039 1481.6133 1483.9325 1486.8123 1490.0142 1533.5472 1560.3575 1583.8974 1590.5148 1610.2275 1611.0803 2856.7535 2861.0457 2874.1670 2973.1665 2981.1079 2982.6867 2989.1032 3004.8290 3024.5993 3025.4381 3034.6788 3045.3916 3050.9989 3076.7333 3077.8482 3083.5724 3087.9061 3111.6696 3115.5865 3121.6426 3121.7536 3133.1415 3143.6387 3162.4173 3168.6780 3173.7952 3183.0639 3580.0427
redmass: 3.9834 6.1255 5.0654 4.4446 4.1632 4.5785 4.0072 3.6958 3.5860 2.1608 3.4075 4.7058 2.9065 2.9196 3.4272 2.0003 3.9990 1.6285 2.6676 4.7846 4.6305 2.0671 2.3786 1.9015 2.2226 4.9793 2.7254 2.9400 2.8933 2.8372 2.7006 4.3037 1.8152 2.5063 3.9772 3.2620 3.0058 4.9848 2.8699 3.1582 5.3260 6.3734 5.9534 4.8723 3.5895 2.7229 1.8212 3.4935 3.7383 1.8549 1.9244 1.1775 1.1463 2.1516 1.6286 4.9035 1.3642 3.3885 1.9828 1.4979 1.9732 1.6779 1.7492 1.3511 1.4148 2.2272 1.3942 4.5628 4.8670 1.3609 2.1320 2.6723 2.4613 2.5028 2.2732 1.8820 1.9222 2.0043 2.0941 2.4368 2.3233 1.9742 2.5213 1.5020 1.5809 1.0660 1.2388 1.5664 2.3446 2.1258 1.6610 1.3582 1.3837 1.3174 1.1752 1.2402 1.1813 1.6059 2.2093 1.8758 1.4719 1.4749 1.4374 1.3828 1.6162 1.9585 1.4856 1.2322 1.2394 2.8816 3.3905 2.7953 2.4764 2.0283 1.0515 1.0811 1.0674 1.2349 1.3303 1.3825 1.1387 1.0827 1.9552 1.0717 1.0735 4.6712 3.4669 6.2522 5.8494 6.5506 6.0619 1.0720 1.0720 1.0712 1.0615 1.0356 1.0354 1.0609 1.0829 1.0890 1.0941 1.0877 1.0904 1.1023 1.0987 1.0984 1.1001 1.1005 1.0864 1.0898 1.0865 1.0883 1.0911 1.0958 1.1013 1.0937 1.0952 1.0932 1.0760
irintensity: 0.0621 0.0122 0.1038 0.5033 0.5396 0.1401 0.2634 0.1094 0.1493 0.3578 0.1430 0.2213 0.5751 0.0542 1.6802 2.4604 0.4457 0.3606 1.9542 0.0343 0.8878 5.4169 0.2533 0.6705 1.0362 7.2446 2.1034 1.8640 2.1738 1.7818 13.4444 1.3080 83.1368 2.4245 8.8342 4.3330 24.5184 13.0534 2.2963 20.0934 17.9576 0.0139 1.3344 10.0236 9.4646 21.8934 49.5614 7.8498 1.8219 17.8273 33.8404 5.0192 5.3255 44.0188 31.5260 28.0371 4.5208 44.5062 18.3966 24.1036 0.1919 1.4518 0.9905 0.1646 1.7760 3.1221 0.0884 1.0346 0.2260 0.4299 10.8153 6.9316 2.2464 16.6038 25.1538 13.4133 12.8468 18.8334 2.5854 8.9506 15.5279 3.6352 53.9728 9.6440 4.5977 0.3281 7.4714 19.4154 6.8365 6.8842 4.2652 34.3149 1.8928 31.6359 7.6447 6.1689 13.7181 10.8920 1.8952 61.6600 15.7473 54.5503 0.8114 4.9443 3.5867 5.6130 2.4572 18.5851 9.9049 18.1215 54.0838 13.8442 45.3185 9.2205 6.9787 0.3440 2.1034 19.3221 8.5478 9.2981 5.3732 16.8619 21.2082 18.1868 19.9046 50.9624 149.2494 331.7219 1.6592 79.4616 2.2461 31.3381 49.4962 286.7988 29.2664 29.2497 20.0019 48.5457 16.8962 25.9246 15.8993 14.1920 28.9260 42.7316 44.6881 58.5786 78.9123 36.9483 9.0725 27.4021 1.2408 16.0127 11.3052 38.0263 21.0115 25.8642 4.3966 0.7563 19.9992
temp: 298.150 k
press: 1.00000 atm
elementType: 17 7 7 7 6 6 6 6 6 6 6 6 6 6 6 6 6 6 6 6 6 6 6 6 6 6 6 1 1 1 1 1 1 1 1 1 1 1 1 1 1 1 1 1 1 1 1 1 1 1 1 1 1 1 1
symmnumber: 1
zpe: 1204580.5 jmol-1
zpe.correction: 0.458800 hartree
zpe.thermalcorrener: 0.485255 hartree
zpe.thermalcorrenthalpy: 0.486199 hartree
zpe.thermalcorrgfe: 0.397650 hartree
zpe.sumelectzpe: -1515.570437 hartree
zpe.sumelectthermal: -1515.543983 hartree
zpe.sumelectthermalent: -1515.543039 hartree
zpe.sumelectthermalfe: -1515.631588 hartree
dipole: 6.4542 3.2284 -2.1280
dipole: 7.5238
quadrupole: -184.2844 -163.6497 -164.2136
quadrupole: -13.9265 0.2009 -2.4781
quadrupole: -13.5685 7.0661 6.5023 -13.9265 0.2009 -2.4781
hfenergy: -1516.0292379 hartree
pointgroup: C01 [X(C23H28Cl1N3)]
dipole: 2.4327804 0.5245822 -1.6026466 debye
polarizability: 308.0996167|-42.671885|299.6187258|-59.2481362|-21.4884027|241.1024346 unknown
InChI: InChI=1S/C23H28ClN3/c1-3-27(4-2)15-13-19(18-8-6-5-7-9-18)17-26-22-12-14-25-23-16-20(24)10-11-21(22)23/h5-12,14,16,19,26H,3-4,13,15,17H2,1-2H3
charge 0 multiplicity 1
55 atoms
Cl -6.501608 1.513936 2.120236
N  3.985743 -1.763411 0.321588
N  -0.68064 0.056463 -1.375659
N  -2.71165 -2.017382 1.787416
C  1.849897 -0.013976 -1.113285
C  3.12544 -0.622498 -1.753212
C  4.283242 -0.759731 -0.735863
C  0.591891 -0.369825 -1.969219
C  1.93273 1.498883 -0.898178
C  4.219276 -3.160569 -0.140087
C  4.670807 -1.46858 1.611575
C  1.61489 2.062661 0.364396
C  2.265167 2.38115 -1.961558
C  -1.325715 -0.608365 -0.346599
C  3.364406 -4.195325 0.616713
C  3.993771 -0.338333 2.409424
C  -2.562024 -0.07461 0.212225
C  1.63326 3.462193 0.564734
C  2.286726 3.780167 -1.76687
C  1.970868 4.327438 -0.500864
C  -0.845347 -1.824763 0.193302
C  -3.201986 -0.81936 1.278095
C  -3.173711 1.137306 -0.238308
C  -1.568397 -2.472728 1.230535
C  -4.413725 -0.316354 1.856077
C  -4.356896 1.617553 0.332378
C  -4.958582 0.871717 1.383867
H  1.733689 -0.503096 -0.126885
H  3.470143 -0.008269 -2.608425
H  2.885902 -1.623713 -2.166446
H  5.228986 -1.007135 -1.279534
H  4.444876 0.221088 -0.252883
H  0.675084 0.1069 -2.964415
H  0.563517 -1.463154 -2.138577
H  3.963404 -3.211468 -1.214788
H  5.302024 -3.435302 -0.064142
H  4.64962 -2.389577 2.221971
H  5.751035 -1.224253 1.448026
H  -0.99248 0.998445 -1.605913
H  1.345374 1.396851 1.19339
H  2.512394 1.976683 -2.951395
H  3.591486 -4.207223 1.69796
H  2.291063 -3.960452 0.501596
H  3.549044 -5.213056 0.224772
H  3.986672 0.615524 1.852088
H  2.946984 -0.609181 2.634916
H  4.527529 -0.166232 3.362806
H  1.383886 3.874619 1.548933
H  2.549125 4.443284 -2.599367
H  1.987462 5.412391 -0.348508
H  0.083863 -2.278727 -0.159822
H  -2.735583 1.72388 -1.054466
H  -1.183602 -3.416617 1.637056
H  -4.872773 -0.897197 2.659769
H  -4.817955 2.544628 -0.018776
