program: Gaussian 09
title: 000222843
version: EM64L-G09RevD.01
frameworkgroup: C1[X(C17H20O2)]
method: RPBEPBE
basis: SDD
operation: Freq
keyword: #pfreq=noraman
keyword: PBEPBE/SDD
title: #p freq=noraman PBEPBE/SDD
converged: YES YES NO NO
title: Mulliken charges:
elementType: O O C C C C C C C C C C C C C C C C C H H H H H H H H H H H H H H H H H H H H
charge: -0.453632 -0.453599 0.071783 0.372530 0.372620 -0.788773 -0.789026 0.174305 0.173885 -0.365100 -0.364601 -0.567751 -0.567644 -0.493488 -0.493651 0.498644 0.498563 -0.817834 -0.817794 0.206169 0.263691 0.225833 0.225883 0.206225 0.263751 0.246733 0.246773 0.211143 0.211113 0.224909 0.224901 0.227047 0.225968 0.225069 0.225947 0.225050 0.227059 0.348655 0.348643
chargesum: 0.00000
title: Mulliken charges with hydrogens summed into heavy atoms:
elementType: O O C C C C C C C C C C C C C C C C C
charge: -0.104976 -0.104956 0.071783 0.372530 0.372620 -0.093080 -0.093167 0.174305 0.173885 -0.118367 -0.117829 -0.356608 -0.356531 -0.268579 -0.268750 0.498644 0.498563 -0.139751 -0.139737
polarizability: 2.39678046e+02 -9.14382675e-02 1.65764647e+02 -2.26941291e+01 3.88926432e-02 1.65442748e+02
1716.lowfreq: -10.2050 -0.0005 0.0001 0.0004 13.5878 22.9588 33.4387 35.1126 39.6336
frequency: 33.4213 35.0090 39.3244 50.6179 55.8096 102.5381 143.2759 193.6479 209.1315 212.1281 212.4047 250.9421 256.3044 281.0737 288.5874 294.4399 318.2424 322.2143 330.0542 331.3569 339.0893 376.5722 403.4448 433.7667 459.8379 478.1544 507.8633 518.0621 521.3679 555.2108 563.2874 595.9649 599.7578 627.0999 720.5260 725.5758 729.4955 745.5219 760.9174 815.9512 816.6770 838.6165 839.3596 906.8504 936.8401 936.9089 942.7354 952.6942 957.6154 1003.2987 1003.6214 1012.0565 1045.4063 1045.4728 1055.7951 1070.7615 1112.4514 1133.1494 1141.9251 1173.8110 1177.5882 1179.4649 1187.6635 1229.4508 1243.1612 1271.2435 1275.3318 1302.9695 1306.0136 1372.3780 1378.5447 1380.9097 1392.3057 1397.6366 1397.8863 1407.6943 1407.9659 1469.2056 1470.9426 1471.0383 1475.1487 1475.7969 1482.2474 1485.4181 1504.6549 1516.8556 1517.6058 1590.3855 1590.7862 1624.0188 1626.6376 2973.2899 2973.4747 2981.0272 2984.8777 3050.3239 3050.3436 3069.0096 3075.4897 3081.9678 3082.4507 3088.7519 3088.9810 3103.1054 3104.7636 3125.7860 3126.0574 3165.9374 3166.1182 3573.3736 3573.6985
redmass: 1.2020 1.0457 3.3774 3.4916 4.8724 3.3113 4.1626 3.6558 4.1848 3.8669 4.3537 3.4845 2.8164 2.6881 1.6914 1.6290 1.7265 1.6035 1.7234 1.4043 1.3835 2.4951 3.1597 2.7845 3.4081 3.5347 4.1808 4.2920 4.0970 7.2507 5.6089 3.4026 3.4802 3.8821 4.9455 6.3024 4.3911 3.7004 2.5475 1.3063 1.3420 1.4584 1.4790 2.6544 1.7073 2.5104 2.4954 1.3667 1.5515 1.6127 1.5871 1.2780 1.5314 1.5308 3.0245 2.8934 1.8937 1.7655 2.3837 1.4148 1.2572 1.3571 1.6427 2.8327 2.7399 3.4164 3.9014 1.3534 1.3773 1.3619 3.7854 3.0285 1.3442 1.3011 1.2981 3.5119 3.0089 1.0669 1.0465 1.0465 1.1031 1.1095 1.0632 1.0541 1.0677 2.6879 2.7219 6.1831 6.1383 6.7699 6.7908 1.0373 1.0373 1.0361 1.0363 1.0977 1.0977 1.0992 1.0982 1.0985 1.0984 1.0907 1.0907 1.0997 1.0994 1.0894 1.0893 1.0934 1.0935 1.0659 1.0659
irintensity: 0.6911 0.4201 0.1230 0.0897 0.5375 0.7625 0.2248 0.6447 0.8037 0.3088 1.1460 0.5065 2.0187 11.7652 0.4765 0.9070 61.9369 31.6082 47.5713 48.7209 20.6870 7.9240 5.4202 3.0131 10.5923 5.2790 1.8052 0.9663 2.5051 0.0015 17.5588 7.2044 9.1648 1.6114 6.3398 0.0344 5.6839 1.5583 0.5992 46.7111 38.2896 6.1226 7.7111 3.0453 15.0890 28.4525 0.0201 0.2164 1.0315 0.2099 0.0158 2.9268 11.1116 10.9410 44.4795 19.7121 97.2061 0.0531 192.6186 0.1399 10.4037 0.2925 7.1497 17.0956 18.5772 2.4689 18.1184 0.3170 56.5178 23.8601 5.4389 15.6643 14.1669 11.8984 5.0325 61.6984 10.4656 7.4751 13.1061 13.2088 6.8517 33.2188 2.1412 5.8089 18.9298 48.4351 8.6103 28.5249 6.7060 39.4544 4.2541 67.7074 33.6173 15.8511 55.1107 23.1022 23.0874 0.0726 92.1118 14.6598 14.4394 28.1946 25.0946 11.2445 15.1318 24.6919 12.5738 15.7218 8.5850 6.0911 37.2524
temp: 298.150 k
press: 1.00000 atm
elementType: 8 8 6 6 6 6 6 6 6 6 6 6 6 6 6 6 6 6 6 1 1 1 1 1 1 1 1 1 1 1 1 1 1 1 1 1 1 1 1
symmnumber: 1
zpe: 845830.5 jmol-1
zpe.correction: 0.322160 hartree
zpe.thermalcorrener: 0.341542 hartree
zpe.thermalcorrenthalpy: 0.342487 hartree
zpe.thermalcorrgfe: 0.274423 hartree
zpe.sumelectzpe: -808.858320 hartree
zpe.sumelectthermal: -808.838938 hartree
zpe.sumelectthermalent: -808.837994 hartree
zpe.sumelectthermalfe: -808.906057 hartree
dipole: 0.0005 -2.4651 0.0036
dipole: 2.4651
quadrupole: -105.6015 -107.4568 -103.2475
quadrupole: -0.0125 1.5167 0.0172
quadrupole: -0.1663 -2.0215 2.1878 -0.0125 1.5167 0.0172
hfenergy: -809.1804803 hartree
pointgroup: C01 [X(C17H20O2)]
dipole: -0.0060017 -0.9697767 0.0104574 debye
polarizability: 239.1251468|-0.7795238|165.7723817|-23.5611802|0.1927753|165.9879122 unknown
InChI: InChI=1S/C17H20O2/c1-11-5-7-13(15(18)9-11)17(3,4)14-8-6-12(2)10-16(14)19/h5-10,18-19H,1-4H3
charge 0 multiplicity 1
39 atoms
O  -0.593318 -0.437821 -2.032417
O  0.602734 -0.395268 2.047227
C  0.014999 1.546331 -0.016786
C  -1.265031 0.671827 0.022671
C  1.284456 0.656005 -0.035218
C  0.11581 2.491294 1.2192
C  -0.075653 2.461475 -1.275828
C  -1.538472 -0.290261 -0.992209
C  1.547718 -0.284637 1.002145
C  -2.24584 0.798203 1.032615
C  2.264831 0.745582 -1.049548
C  -2.713042 -1.074523 -0.984859
C  2.712091 -1.083984 1.011527
C  -3.428855 0.024608 1.048997
C  3.437769 -0.043333 -1.049461
C  -3.681758 -0.931092 0.037766
C  3.680378 -0.977702 -0.016038
C  -4.944789 -1.775861 0.037622
C  4.931919 -1.839274 0.002114
H  -0.736865 3.194979 1.248766
H  0.150106 1.92583 2.164246
H  1.042011 3.087934 1.139167
H  -0.995095 3.070207 -1.210457
H  0.78466 3.15482 -1.323331
H  -0.116789 1.87324 -2.20664
H  -2.077409 1.506708 1.848177
H  2.103563 1.43615 -1.881715
H  -2.880067 -1.803879 -1.791713
H  2.871244 -1.796071 1.835193
H  -4.155568 0.162347 1.858091
H  4.164403 0.065154 -1.863091
H  -5.542209 -1.61125 -0.879192
H  -4.710021 -2.856253 0.084261
H  -5.585431 -1.534051 0.90301
H  4.682354 -2.917177 -0.017387
H  5.573413 -1.627383 -0.870368
H  5.533843 -1.660383 0.913298
H  -0.851801 -1.185826 -2.626122
H  0.853914 -1.130763 2.659384
