program: Gaussian 09
title: 000217666
version: EM64L-G09RevD.01
frameworkgroup: C1[X(C18H16N2O2)]
method: RPBEPBE
basis: SDD
operation: Freq
keyword: #p
keyword: freq=noraman
keyword: PBEPBE/SDD
title: #p freq=noraman PBEPBE/SDD
converged: YES YES NO NO
title: Mulliken charges:
elementType: O O N N C C C C C C C C C C C C C C C C C C H H H H H H H H H H H H H H H H
charge: -0.279034 -0.260033 -0.162995 -0.447885 -0.449335 -0.445025 -0.343521 -0.360053 0.102593 0.356462 0.254545 0.289500 -0.549418 0.316256 -0.442411 -0.371156 0.109636 -0.024677 -0.380159 -0.348803 -0.236848 -0.240630 0.233471 0.223031 0.232267 0.224877 0.234374 0.229180 0.228485 0.268928 0.246788 0.265149 0.223317 0.330122 0.226616 0.278499 0.231462 0.236425
chargesum: 0.00000
title: Mulliken charges with hydrogens summed into heavy atoms:
elementType: O O N N C C C C C C C C C C C C C C C C C C
charge: -0.279034 -0.260033 -0.162995 -0.117763 0.007167 0.012119 0.120033 0.137361 0.102593 0.356462 0.254545 0.289500 -0.302631 0.316256 -0.177262 -0.147839 0.109636 -0.024677 -0.153543 -0.070304 -0.005385 -0.004205
polarizability: 3.60984973e+02 -7.68572610e+00 2.16418800e+02 -1.87434462e+01 -1.08670378e+01 1.16905755e+02
1716.lowfreq: -17.7560 -4.1251 -0.0005 0.0004 0.0007 4.7909 18.9733 30.6239 37.9928
frequency: 15.5050 30.5034 37.5230 60.5834 84.8593 101.2179 130.7717 148.9416 196.4622 210.1744 221.5322 258.1135 261.2269 296.6537 307.6268 327.9778 379.7719 425.0551 430.4417 444.8222 461.6529 494.3845 513.5260 543.3540 564.5423 599.3161 621.5401 636.4712 644.8597 683.9322 700.7990 722.3745 727.0710 741.9920 749.6140 783.8787 790.4577 794.6342 837.3308 843.9991 858.9575 871.4110 893.6481 894.4288 914.0635 919.6438 954.5024 964.9953 979.7832 986.3289 994.3976 1006.7162 1039.3284 1058.7638 1086.1130 1107.9673 1133.8378 1136.9057 1150.4268 1153.2713 1165.9747 1177.0197 1183.5132 1221.5789 1241.0274 1246.1291 1261.1633 1281.1495 1292.1741 1300.3836 1313.5077 1322.4069 1331.3462 1333.9497 1361.4464 1378.9888 1392.4526 1398.3783 1436.0040 1460.8121 1466.2687 1471.6670 1472.5323 1488.9766 1496.6369 1517.5349 1543.7868 1559.0147 1589.7258 1612.3379 1626.3200 1630.1796 2985.3037 2988.9150 3008.4076 3010.3963 3064.0065 3074.8019 3080.1999 3093.5806 3129.0792 3133.1375 3145.7198 3150.8277 3160.4031 3171.1778 3173.7834 3516.4326
redmass: 2.7011 4.4657 4.1445 3.9366 4.9189 4.3261 5.9533 6.0913 5.6637 2.0200 4.6284 2.8115 4.3063 6.3211 5.8594 6.0916 5.6461 3.3962 6.0871 3.6776 6.5494 7.5529 3.9924 4.0514 1.9366 5.9707 5.1588 6.0980 2.1111 5.0875 4.1464 3.0467 2.3596 4.4026 2.0325 4.9561 1.8275 2.7710 1.9287 1.7012 2.0437 3.0512 1.6053 1.6695 2.0123 1.6144 3.1016 1.4036 1.3771 2.0017 6.6244 1.3433 2.2778 1.9261 2.8399 1.6031 2.1660 1.9962 3.1371 1.4191 1.5077 1.1006 1.6035 1.2948 1.3050 1.5154 1.8888 1.7572 4.3317 1.3460 1.2400 2.0974 1.4585 1.4521 1.9707 6.8832 8.7064 7.1157 3.0282 2.6179 1.0874 1.1838 2.5825 1.0913 1.1085 3.2635 8.0194 7.0170 6.7900 6.4270 7.0409 5.2788 1.0652 1.0677 1.0654 1.0620 1.0968 1.0961 1.1010 1.1054 1.0911 1.0858 1.0892 1.0885 1.0938 1.0998 1.0967 1.0764
irintensity: 0.1573 3.2056 1.1740 2.8375 0.2125 0.8442 2.9011 0.2539 2.3147 3.3253 1.7433 3.0952 3.9758 16.0763 5.8115 0.4619 11.3027 6.0431 4.0883 5.0254 3.7915 2.9308 1.0015 1.5876 2.4057 11.2757 3.6149 2.4064 2.6344 7.3372 8.9537 8.3297 23.2554 1.6628 127.5508 9.0438 38.2843 0.3047 19.7431 13.5174 2.7567 6.1426 27.4475 10.3984 7.9204 0.9437 4.3440 0.9967 1.8510 3.1714 2.8190 0.5471 12.6614 3.8457 0.5193 8.2824 39.4747 8.1123 4.7915 14.8887 7.8492 3.8690 13.7312 37.5085 15.9295 8.7434 17.2561 2.5343 43.0755 3.1939 0.1747 44.4317 24.1186 10.4433 17.6166 258.0451 93.7793 117.0814 11.0367 4.2106 9.9368 22.4394 7.0878 13.1255 15.1500 29.4628 211.9810 31.3270 9.6792 128.5633 2.6626 370.7590 58.6174 14.6479 30.2534 32.2410 26.9922 14.0606 25.0960 56.4531 12.4209 3.7670 8.2699 2.1074 10.7102 20.9337 16.1014 29.9855
temp: 298.150 k
press: 1.00000 atm
elementType: 8 8 7 7 6 6 6 6 6 6 6 6 6 6 6 6 6 6 6 6 6 6 1 1 1 1 1 1 1 1 1 1 1 1 1 1 1 1
symmnumber: 1
zpe: 791877.3 jmol-1
zpe.correction: 0.301610 hartree
zpe.thermalcorrener: 0.319410 hartree
zpe.thermalcorrenthalpy: 0.320354 hartree
zpe.thermalcorrgfe: 0.253631 hartree
zpe.sumelectzpe: -953.987104 hartree
zpe.sumelectthermal: -953.969304 hartree
zpe.sumelectthermalent: -953.968360 hartree
zpe.sumelectthermalfe: -954.035083 hartree
dipole: 2.2355 0.0223 3.4888
dipole: 4.1436
quadrupole: -109.4246 -133.4065 -133.3891
quadrupole: 28.8457 4.3624 -6.4565
quadrupole: 15.9821 -7.9998 -7.9824 28.8457 4.3624 -6.4565
hfenergy: -954.288714 hartree
pointgroup: C01 [X(C18H16N2O2)]
dipole: -0.8741116 0.4882722 1.2865377 debye
polarizability: 361.3598831|2.038105|210.1752426|18.174971|-26.2111076|122.774403 unknown
InChI: InChI=1S/C18H16N2O2/c21-17-15-6-2-1-5-13(15)14-8-7-12(11-16(14)19-17)18(22)20-9-3-4-10-20/h1-2,5-8,11,19H,3-4,9-10H2
charge 0 multiplicity 1
38 atoms
O  -3.53111 1.26498 -1.857301
O  3.151666 -2.924532 0.565322
N  -3.928997 -0.083522 -0.005388
N  1.238177 -1.683478 0.138862
C  -4.987333 -1.049682 1.915742
C  -6.0219 -0.191803 1.143984
C  -3.620379 -0.554521 1.380667
C  -5.398847 -0.069862 -0.263501
C  -3.085038 0.624222 -0.846694
C  -1.604454 0.630747 -0.550361
C  1.239379 0.741219 -0.187677
C  0.528826 -0.49777 -0.110805
C  -0.877724 -0.546095 -0.2837
C  2.698242 0.732726 0.012379
C  -0.905649 1.864566 -0.664421
C  0.482413 1.912274 -0.472443
C  3.367867 -0.507891 0.269883
C  2.623407 -1.79108 0.340085
C  3.490171 1.916739 -0.039643
C  4.77192 -0.549186 0.465032
C  4.881062 1.867144 0.154434
C  5.531506 0.630383 0.408417
H  -5.062434 -0.940846 3.010679
H  -5.124279 -2.118815 1.669154
H  -7.024247 -0.650811 1.11991
H  -6.112748 0.808165 1.606895
H  -3.224931 0.283499 1.987542
H  -2.866524 -1.358542 1.387432
H  -5.67548 -0.926638 -0.908499
H  -5.665069 0.854924 -0.80134
H  -1.38825 -1.515773 -0.24953
H  -1.46911 2.765526 -0.923384
H  0.990256 2.877694 -0.556724
H  0.727199 -2.570401 0.182657
H  3.017653 2.884365 -0.232906
H  5.23013 -1.524732 0.657458
H  5.467038 2.79178 0.108678
H  6.615693 0.599229 0.558103
