program: Gaussian 09
title: 000217661
version: EM64L-G09RevD.01
frameworkgroup: C1[X(C20H16O)]
method: RPBEPBE
basis: SDD
operation: Freq
keyword: #pfreq=noraman
keyword: PBEPBE/SDD
title: #p freq=noraman PBEPBE/SDD
converged: NO YES NO NO
title: Mulliken charges:
elementType: O C C C C C C C C C C C C C C C C C C C C H H H H H H H H H H H H H H H H
charge: -0.230981 0.350416 0.300230 0.339653 0.296935 0.000135 -0.408619 -0.397273 -0.382162 -0.378489 0.434696 -0.363032 -0.363006 -0.424338 -0.359269 -0.392165 -0.392170 -0.805867 -0.236499 -0.236891 -0.238855 0.242078 0.241280 0.267050 0.270213 0.265609 0.270675 0.234064 0.233339 0.238797 0.241026 0.232459 0.226352 0.237552 0.227279 0.228152 0.231627
chargesum: 0.00000
title: Mulliken charges with hydrogens summed into heavy atoms:
elementType: O C C C C C C C C C C C C C C C C C C C C
charge: -0.230981 0.350416 0.300230 0.339653 0.296935 0.000135 -0.166541 -0.155993 -0.115111 -0.108276 0.434696 -0.097424 -0.092332 -0.190273 -0.125930 -0.153367 -0.151144 -0.109505 -0.009221 -0.008739 -0.007228
polarizability: 4.03495883e+02 -2.62798055e+00 2.17598423e+02 1.04140376e+01 -1.28594693e+00 1.05362585e+02
1716.lowfreq: -9.4242 -0.0009 -0.0006 0.0002 1.4244 7.1722 24.7165 27.1987 39.6041
frequency: 24.5661 26.9712 39.5986 48.1873 71.2796 85.0355 101.2510 129.3257 166.5768 197.8917 221.4399 260.3264 304.6202 318.3368 343.6041 389.2103 402.7971 406.1263 412.7435 424.1552 472.7976 490.0466 526.1514 564.9308 597.6237 613.6540 631.8781 636.6794 659.0893 683.0233 700.9335 732.8463 747.1969 754.0524 781.1386 793.3804 840.1903 849.2857 849.7626 858.8903 865.8094 916.7307 923.5000 967.1537 974.7978 978.0525 984.5376 986.3950 989.4420 991.7711 995.8521 996.1536 1014.1182 1018.4317 1040.6760 1047.0757 1085.8530 1122.3203 1125.8623 1152.2502 1174.5120 1189.7404 1192.9372 1205.3580 1224.2240 1286.7525 1291.1303 1304.9116 1309.2907 1315.6547 1356.0480 1368.7717 1376.4440 1397.2098 1409.5284 1415.1866 1437.8800 1468.2682 1472.4460 1475.2384 1500.6788 1511.6195 1523.8152 1560.5034 1578.0042 1587.7628 1612.0915 1615.5348 1620.1687 2978.5201 3057.4686 3088.2369 3124.0628 3125.0856 3125.8070 3129.3332 3133.7761 3136.2330 3143.3095 3151.1084 3151.8127 3156.5703 3158.7833 3162.3041 3167.0585
redmass: 1.0438 4.0263 4.9211 4.0448 4.7586 4.2058 4.6608 5.3211 5.0690 5.2593 5.9617 4.6359 4.6967 6.1530 3.1105 4.2968 2.8423 2.8494 3.3186 4.5206 3.5412 3.4313 4.4335 3.1340 5.8461 6.5640 6.7326 6.9073 5.8838 3.5192 1.7581 3.3149 5.6915 2.0501 2.3534 5.1238 1.5272 1.2858 1.2903 1.3044 1.7039 3.7740 1.6707 1.3939 1.4438 1.3256 1.6441 1.4933 2.5265 1.5117 1.3224 6.0306 2.9332 2.6072 1.9000 1.5791 1.6201 1.3630 1.3456 3.2011 1.0528 1.1123 1.1255 1.1736 2.9331 2.7949 3.4495 1.4226 1.3691 1.3861 2.9169 4.5309 8.8056 1.2468 3.6012 4.0506 2.3845 1.0531 1.1197 2.1373 2.6782 2.8837 8.1255 6.2552 6.4410 6.3942 6.0129 6.2264 6.3621 1.0375 1.0969 1.0991 1.0887 1.0847 1.0886 1.0876 1.0875 1.0882 1.0917 1.0961 1.0957 1.0951 1.0958 1.0966 1.1016
irintensity: 0.6600 0.2612 0.7750 0.2012 1.0034 0.2858 1.1338 1.8151 2.6484 0.3194 1.8149 5.2951 0.2673 0.2121 2.7899 5.4813 1.1114 0.1101 1.8214 4.5726 18.2010 4.4708 5.2194 4.2397 7.5541 0.0766 0.7944 0.5924 2.3654 24.6243 48.6284 3.1263 7.7518 118.5571 9.5403 2.4880 21.1893 5.3618 5.3494 6.7963 33.0835 68.2139 11.3164 0.8919 0.8257 0.2948 5.8700 5.4506 5.1279 5.6960 0.1369 10.7240 4.6446 0.7286 2.1437 16.8139 8.7903 11.6392 12.6723 6.0009 0.0151 43.8499 35.3599 14.1270 1.3387 329.6147 89.8632 15.3513 46.6306 14.8564 16.5427 1.7221 0.6643 14.3469 12.5989 15.2259 7.8553 14.0517 12.1514 7.7854 0.2773 12.3797 145.8803 25.8571 28.0853 0.8185 21.9049 138.6370 20.8938 31.8889 18.1500 17.3960 11.0101 12.5145 23.3407 1.6858 12.3004 9.7735 9.2988 29.7284 17.0697 16.4523 7.9317 1.1072 30.4412
temp: 298.150 k
press: 1.00000 atm
elementType: 8 6 6 6 6 6 6 6 6 6 6 6 6 6 6 6 6 6 6 6 6 1 1 1 1 1 1 1 1 1 1 1 1 1 1 1 1
symmnumber: 1
zpe: 772222.7 jmol-1
zpe.correction: 0.294124 hartree
zpe.thermalcorrener: 0.311783 hartree
zpe.thermalcorrenthalpy: 0.312727 hartree
zpe.thermalcorrgfe: 0.245985 hartree
zpe.sumelectzpe: -845.533977 hartree
zpe.sumelectthermal: -845.516318 hartree
zpe.sumelectthermalent: -845.515374 hartree
zpe.sumelectthermalfe: -845.582117 hartree
dipole: 0.4254 -3.8322 -0.0100
dipole: 3.8557
quadrupole: -92.2960 -120.4044 -126.6708
quadrupole: 10.8304 2.6409 -0.1126
quadrupole: 20.8278 -7.2807 -13.5471 10.8304 2.6409 -0.1126
hfenergy: -845.8281012 hartree
pointgroup: C01 [X(C20H16O1)]
dipole: -0.1698837 1.2482841 0.8450373 debye
polarizability: 402.1440097|10.7681013|181.6951507|-20.0329308|51.894171|142.6177313 unknown
InChI: InChI=1S/C20H16O/c1-15-7-9-18(10-8-15)20(21)19-13-11-17(12-14-19)16-5-3-2-4-6-16/h2-14H,1H3
charge 0 multiplicity 1
37 atoms
O  2.089015 -2.168459 -1.732683
C  -2.300014 -0.137717 -0.17486
C  0.455645 -0.75464 -0.684088
C  -3.730638 0.182652 0.093183
C  3.023133 -0.305038 -0.536594
C  1.86939 -1.132761 -1.023366
C  -1.314804 0.887558 -0.225837
C  -1.874977 -1.479477 -0.39849
C  0.039533 0.587148 -0.468475
C  -0.528136 -1.779919 -0.660006
C  5.334186 1.131975 0.360137
C  2.986608 0.446141 0.668002
C  4.236397 -0.342075 -1.277703
C  4.129581 1.148208 1.108127
C  5.365481 0.372584 -0.842702
C  -4.090784 1.268518 0.939268
C  -4.774872 -0.588451 -0.489718
C  6.564153 1.884424 0.833077
C  -5.444615 1.57309 1.19335
C  -6.129133 -0.284767 -0.236762
C  -6.47166 0.797904 0.606371
H  -1.61843 1.934012 -0.112336
H  -2.605696 -2.293513 -0.340301
H  0.768183 1.401438 -0.536276
H  -0.207031 -2.809757 -0.847584
H  2.078729 0.453856 1.280111
H  4.266057 -0.945726 -2.190951
H  4.088393 1.71137 2.048013
H  6.288184 0.342478 -1.435054
H  -3.305656 1.857729 1.426187
H  -4.525589 -1.409631 -1.170903
H  6.964276 2.540312 0.037954
H  6.344198 2.511551 1.71362
H  7.374738 1.184515 1.112282
H  -5.698758 2.408097 1.855719
H  -6.916949 -0.885904 -0.704147
H  -7.523239 1.033876 0.803034
