program: Gaussian 09
title: 000217658
version: EM64L-G09RevD.01
frameworkgroup: C1[X(C6H7NO2S)]
method: RPBEPBE
basis: SDD
operation: Freq
keyword: #p
keyword: freq=noraman
keyword: PBEPBE/SDD
title: #p freq=noraman PBEPBE/SDD
converged: YES YES NO NO
title: Mulliken charges:
elementType: S O O N C C C C C C H H H H H H H
charge: 0.245657 -0.210130 -0.160614 -0.135010 -0.445700 0.315398 -0.774870 -0.084547 -0.020834 -0.541904 0.257776 0.243205 0.306232 0.305783 0.249910 0.222049 0.227600
chargesum: 0.00000
title: Mulliken charges with hydrogens summed into heavy atoms:
elementType: S O O N C C C C C C
charge: 0.245657 -0.210130 -0.160614 -0.135010 0.055281 0.315398 -0.162855 -0.084547 0.229075 -0.092256
polarizability: 1.12585094e+02 5.48925547e+00 1.01665158e+02 -1.94196446e+00 1.71227648e+00 5.66041165e+01
1716.lowfreq: -5.2273 -0.0024 0.0026 0.0031 4.3175 10.0925 39.4656 60.9528 98.4721
frequency: 39.2785 60.9225 98.4707 120.0177 160.8882 266.0337 326.7275 366.1106 387.2768 432.7582 469.9627 558.7475 564.8326 597.8298 622.6755 689.6206 734.1969 854.6234 896.9442 899.5745 949.2419 968.0342 1007.9130 1023.4130 1109.5951 1125.7924 1186.2122 1231.0636 1279.2117 1287.0470 1330.3471 1352.9788 1424.7296 1430.9560 1445.7726 1620.3148 1662.2728 1682.6280 3023.3098 3053.3663 3092.2865 3095.4341 3122.0731 3125.7693 3204.0256
redmass: 4.1520 3.8953 4.3607 3.2583 3.3976 3.5175 5.9445 3.9281 3.0041 7.3085 3.8289 5.8164 3.0672 4.6650 7.3061 2.6858 5.0906 3.5706 1.6762 1.6758 2.5611 1.3380 1.1657 3.2565 3.0645 1.1545 2.5838 1.3696 2.1692 1.4113 1.6743 1.4309 1.0860 1.1624 1.1156 12.4540 4.6161 11.5479 1.0595 1.0571 1.0821 1.0801 1.0965 1.1067 1.1149
irintensity: 0.3830 0.7555 5.5623 7.7174 1.1334 5.0010 14.9334 0.8310 2.4906 12.7663 6.6121 9.9604 1.1066 11.5116 11.0184 45.4418 10.9478 8.7005 21.3192 25.2200 30.4822 70.4520 22.7747 5.3807 67.0526 0.2167 42.4300 49.7240 156.3035 38.2039 55.0756 38.5619 12.4478 12.2937 38.4404 516.8999 4.2791 93.1194 13.1375 4.1028 1.9255 4.0290 4.7076 0.1175 18.1827
temp: 298.150 k
press: 1.00000 atm
elementType: 16 8 8 7 6 6 6 6 6 6 1 1 1 1 1 1 1
symmnumber: 1
zpe: 322879.8 jmol-1
zpe.correction: 0.122978 hartree
zpe.thermalcorrener: 0.132952 hartree
zpe.thermalcorrenthalpy: 0.133896 hartree
zpe.thermalcorrgfe: 0.086214 hartree
zpe.sumelectzpe: -835.351166 hartree
zpe.sumelectthermal: -835.341193 hartree
zpe.sumelectthermalent: -835.340249 hartree
zpe.sumelectthermalfe: -835.387931 hartree
dipole: 0.2683 1.3668 0.2999
dipole: 1.4248
quadrupole: -60.9731 -77.0326 -63.4557
quadrupole: -7.5318 0.4683 0.4402
quadrupole: 6.1807 -9.8788 3.6981 -7.5318 0.4683 0.4402
hfenergy: -835.4741445 hartree
pointgroup: C01 [X(C6H7N1O2S1)]
dipole: 0.1106265 -0.5452308 -0.0685793 debye
dipolederiv: -0.5127403 -0.2598185 -0.1270998 -0.2738236 -0.1954271 -0.0769427 -0.1714539 -0.0910649 -0.0861617 -0.5966996 0.3866573 -0.1263207 0.1219499 -0.9270429 0.1227327 -0.1141486 0.17315 -0.3799802 -0.579337 -0.2003063 -0.0755926 -0.1864437 -1.2355271 -0.0743334 -0.0901665 -0.0600865 -0.3078285 -1.0336991 0.0711346 -0.1402795 0.2162153 -1.4011582 0.1786745 -0.2229129 0.0284706 -0.2752369 0.6661214 0.0964952 0.0114306 0.1857399 0.1191037 0.0362439 0.0683522 0.1116026 0.2552603 0.7102529 -0.0922267 0.1998445 0.1006571 1.5219436 -0.1375358 0.1996287 -0.0753301 0.2742483 -0.3412952 -0.0765204 -0.1491224 -0.180744 0.247024 -0.0632396 -0.1745876 -0.025233 0.0453789 1.5077087 0.018985 0.4009191 0.0564799 1.7332059 0.050247 0.4789398 -0.0264604 0.2996295 -0.0545155 -0.0959337 -0.1298482 -0.0583666 0.0002888 -0.1565263 -0.1958861 -0.1476521 -0.0505753 -0.2143625 -0.0835087 -0.118199 -0.1048976 -0.0642821 -0.1776909 -0.0784761 -0.1625653 -0.0710789 0.0014951 0.0369451 0.0679925 -0.04989 0.013013 -0.105492 0.042304 -0.0476475 0.0425886 0.0137847 0.0011736 -0.0203678 0.0390507 0.03052 0.1128127 0.0064215 0.0298631 0.0607263 0.0999656 0.0649982 0.0131246 0.0252877 0.0117639 -0.0496342 -0.0145971 -0.0440877 0.0312811 0.0697105 0.0164776 0.0273867 -0.014407 0.0156923 0.0556864 0.0503769 0.07521 0.0614988 0.1027947 0.0813498 0.0144702 0.0473568 0.006796 0.1072079 0.0605635 0.0763193 0.0329565 0.0301394 0.0064097 0.1214369 0.0174147 0.1132966 0.0712322 0.1482859 0.0633327 0.0177706 0.1306762 0.0276881 0.030225 0.0584206 0.0107894 0.1065575 0.0073561 0.1221791 0.0495227 unknown
polarizability: 112.192521|-5.1802331|101.6244291|5.3692017|-2.1936322|57.037418 unknown
InChI: InChI=1S/C6H7NO2S/c1-2-3-7-5(8)4-10-6(7)9/h2H,1,3-4H2
charge 0 multiplicity 1
17 atoms
S  -2.617906 0.366842 -0.60328
O  0.196668 -2.245603 0.509058
O  -0.771653 2.326551 0.034095
N  -0.108982 0.080829 0.336085
C  1.263975 0.425507 0.80411
C  -0.519892 -1.259804 0.209035
C  -1.946414 -1.374248 -0.328148
C  -1.010418 1.106754 -0.026481
C  2.209261 0.685079 -0.354164
C  3.291449 -0.084017 -0.624544
H  1.16988 1.324521 1.439086
H  1.610446 -0.426154 1.413016
H  -1.941074 -1.926378 -1.280711
H  -2.576335 -1.906694 0.400851
H  1.980115 1.563888 -0.972208
H  3.9624 0.14837 -1.459058
H  3.535783 -0.967543 -0.02224
