program: Gaussian 09
title: 000217657
version: EM64L-G09RevD.01
frameworkgroup: C1[X(C6H7NO3S2)]
method: RPBEPBE
basis: SDD
operation: Freq
keyword: #p
keyword: freq=noraman
keyword: PBEPBE/SDD
title: #p freq=noraman PBEPBE/SDD
converged: YES YES NO NO
title: Mulliken charges:
elementType: S S O O O N C C C C C C H H H H H H H
charge: 0.324572 0.129837 -0.199025 -0.414920 -0.209527 -0.094919 -0.102145 0.353049 -0.797023 -0.674488 -0.526595 0.196145 0.270140 0.310639 0.305318 0.253964 0.230343 0.255836 0.388798
chargesum: 0.00000
title: Mulliken charges with hydrogens summed into heavy atoms:
elementType: S S O O O N C C C C C C
charge: 0.324572 0.129837 -0.199025 -0.026122 -0.209527 -0.094919 0.167995 0.353049 -0.181065 0.065655 -0.526595 0.196145
polarizability: 1.31936729e+02 -5.43142756e+00 1.38362122e+02 8.32061339e+00 -1.09492509e+00 7.32205939e+01
1716.lowfreq: -9.4891 -5.6518 -0.0011 -0.0008 0.0021 7.4907 44.7456 64.0979 77.1084
frequency: 44.7304 64.0949 77.1064 120.8719 134.7425 162.8138 208.1713 216.3544 269.1720 338.6890 348.7686 394.2703 418.2582 479.5344 506.6571 522.1373 525.6757 587.6906 611.9102 634.1972 709.8572 716.7004 764.8154 854.3930 892.0119 941.5752 1017.0892 1044.7316 1071.6633 1117.4978 1119.6633 1136.8418 1224.8812 1240.5784 1277.0455 1291.5215 1318.4070 1348.1783 1393.6890 1422.4475 1466.0898 1483.1783 1638.7810 1668.6840 2957.4396 3011.5550 3050.9953 3115.6317 3122.0583 3123.6797 3529.5531
redmass: 6.2870 8.8585 10.7909 3.1353 7.6830 5.1537 2.5802 1.2607 6.4899 6.4090 9.0105 16.2278 4.2649 5.0243 9.0022 4.7467 5.1437 1.9720 4.3342 2.2999 4.8235 5.3000 4.1708 3.1777 1.6391 2.6030 4.0727 3.5304 2.0151 1.2560 2.5963 2.1367 1.3194 4.3117 1.4875 6.0014 2.3325 1.5034 1.1979 1.0812 1.0437 1.0559 11.9517 9.4688 1.0810 1.0352 1.0570 1.1013 1.1010 1.1067 1.0643
irintensity: 0.6279 2.6312 0.7710 3.2950 6.5597 2.7031 1.7207 1.2918 2.2692 1.9116 1.7106 7.2271 0.1975 37.4677 13.1932 13.2017 28.4367 54.8672 7.2868 61.7221 18.3678 17.5566 15.4881 15.3644 7.0368 38.5420 95.0404 140.2576 16.9917 5.7510 21.9417 40.1007 27.7953 399.1639 21.5829 151.2514 39.3768 89.1031 28.8869 12.7646 13.0097 9.1548 210.2204 295.1966 53.1707 11.1276 3.5340 8.8310 6.5975 0.0689 37.2765
temp: 298.150 k
press: 1.00000 atm
elementType: 16 16 8 8 8 7 6 6 6 6 6 6 1 1 1 1 1 1 1
symmnumber: 1
zpe: 339363.1 jmol-1
zpe.correction: 0.129257 hartree
zpe.thermalcorrener: 0.141464 hartree
zpe.thermalcorrenthalpy: 0.142409 hartree
zpe.thermalcorrgfe: 0.089766 hartree
zpe.sumelectzpe: -1308.504843 hartree
zpe.sumelectthermal: -1308.492635 hartree
zpe.sumelectthermalent: -1308.491691 hartree
zpe.sumelectthermalfe: -1308.544334 hartree
dipole: -1.1042 -1.8377 -0.2770
dipole: 2.1617
quadrupole: -95.7897 -84.8567 -78.2428
quadrupole: 9.7544 -5.2111 3.8632
quadrupole: -9.4933 1.4397 8.0536 9.7544 -5.2111 3.8632
hfenergy: -1308.6340995 hartree
pointgroup: C01 [X(C6H7N1O3S2)]
dipole: -0.5410945 -0.6042129 -0.2558534 debye
dipolederiv: -0.3327491 -0.2777174 -0.0976474 -0.3048085 -0.2315998 -0.0844948 -0.1061413 -0.0775879 0.0179615 -0.3279924 -0.0721331 -0.0362822 -0.0326021 -0.872088 -0.1015923 -0.0399156 -0.1213506 -0.1226035 -0.7837336 0.4874091 -0.0130086 0.2181123 -0.9199887 -0.0143539 -0.0348746 0.0192802 -0.3290344 -0.3944354 -0.0395376 -0.2330979 -0.1016407 -0.3246631 -0.0381655 -0.1889625 -0.0099373 -1.1288959 -1.1058647 0.0486976 -0.206844 0.1176641 -0.2998488 -0.0004008 0.1003796 -0.0301666 -0.579698 -0.9595832 0.2474833 -0.1499832 0.5005547 -1.5430624 -0.0973016 -0.1012429 -0.1561994 -0.1970654 0.3127424 0.0887597 0.1718147 0.4682811 0.0390874 -0.0726375 0.2163005 -0.0336572 0.1704169 0.8452851 -0.196933 0.0871204 -0.2513061 1.6134189 0.1218591 0.080039 0.1484921 0.2575277 -0.3591271 -0.1809506 -0.1056791 -0.2567345 0.0967317 -0.0503826 -0.1379134 -0.0433165 0.0683773 -0.1027081 0.0013748 -0.0146986 -0.0650037 0.0475228 0.0119233 -0.0278224 0.0236131 -0.0287996 1.1427186 -0.1445778 0.2226407 -0.0559577 1.6413977 0.2073344 0.2429698 0.2068339 -0.1163371 1.4433542 -0.1295994 0.1958746 -0.1309912 0.2499938 0.12278 -0.0950472 0.0856004 1.3438698 0.1945232 0.0254278 0.0059106 -0.192409 0.0569619 0.0432747 0.0018715 0.0279524 0.0614419 0.1040054 0.0726443 0.0188471 0.0247306 0.0310562 -0.0451389 -0.008765 -0.0512143 0.0292546 0.0936055 0.0476628 0.0204912 -0.0033511 -0.0030383 0.044813 0.0374284 0.0689487 0.069596 -0.0546874 -0.0671026 -0.0568209 -0.0635841 0.0820863 0.0017601 -0.0516433 0.0028428 0.0997181 0.0269219 0.0614216 0.1108942 0.0542282 0.0571372 -0.0551679 0.0763023 -0.0242288 -0.0147464 0.1230369 -0.0249086 -0.0017363 0.0062134 -0.0591621 0.0535143 0.0233794 -0.0256326 0.0824259 0.1346879 0.0525792 0.0822047 0.0686045 0.338057 -0.0476229 0.0136579 -0.0102727 0.3165905 unknown
polarizability: 130.0129749|-5.9874826|137.9206697|8.2089631|11.5612363|75.5858003 unknown
InChI: InChI=1S/C6H7NO3S2/c1-3(5(9)10)7-4(8)2-12-6(7)11/h3,9H,2H2,1H3
charge 0 multiplicity 1
19 atoms
S  -3.025376 0.043248 -0.251439
S  -1.483298 2.642394 0.356052
O  0.285149 -2.141664 0.087195
O  1.412622 0.032882 -1.772851
O  3.19301 -0.042365 -0.278773
N  -0.409901 0.100589 0.227214
C  0.954263 0.593395 0.544973
C  -0.626252 -1.283172 0.01954
C  -2.082771 -1.59117 -0.306079
C  1.385933 0.228304 1.977185
C  -1.505618 0.974511 0.138551
C  1.979306 0.132489 -0.50014
H  0.881199 1.698695 0.453299
H  -2.155939 -2.030286 -1.313291
H  -2.499926 -2.291681 0.433806
H  2.39831 0.621872 2.163477
H  0.687722 0.676782 2.703667
H  1.413856 -0.864415 2.114604
H  2.112511 -0.23911 -2.425293
