program: Gaussian 09
title: 000222810
version: EM64L-G09RevD.01
frameworkgroup: C1[X(C21H34O4)]
method: RPBEPBE
basis: SDD
operation: Freq
keyword: #pfreq=noraman
keyword: PBEPBE/SDD
title: #p freq=noraman PBEPBE/SDD
converged: YES YES NO NO
title: Mulliken charges:
elementType: O O O O C C C C C C C C C C C C C C C C C C C C C H H H H H H H H H H H H H H H H H H H H H H H H H H H H H H H H H H
charge: -0.431651 -0.465359 -0.443811 -0.217596 -0.177807 -0.129783 -0.124219 0.351132 0.358636 -0.061530 -0.218738 -0.569747 0.167706 -0.511409 -0.556433 -0.492919 -0.558323 -0.491167 -0.525469 -0.824548 -0.825008 -0.450769 -0.067873 0.143265 -0.770268 0.202483 0.229121 0.171748 0.188647 0.255329 0.216486 0.227629 0.220774 0.212979 0.222830 0.236813 0.196871 0.213828 0.275354 0.232399 0.266077 0.184030 0.231906 0.181231 0.252680 0.233193 0.221121 0.216248 0.234332 0.214872 0.216804 0.201021 0.182153 0.327073 0.338553 0.265913 0.253336 0.242176 0.327678
chargesum: 0.00000
title: Mulliken charges with hydrogens summed into heavy atoms:
elementType: O O O O C C C C C C C C C C C C C C C C C C C C C
charge: -0.104579 -0.126806 -0.116133 -0.217596 0.024676 0.099338 0.047529 0.351132 0.358636 0.127117 0.036591 -0.125632 0.167706 -0.077656 -0.096789 -0.082220 -0.050569 -0.041060 -0.112332 -0.117554 -0.159556 -0.032944 0.114281 0.143265 -0.008843
polarizability: 2.64867972e+02 2.16088032e+00 2.15447804e+02 -4.40399538e+00 1.39463044e+00 1.98639113e+02
1716.lowfreq: -6.1897 -0.0659 -0.0544 -0.0009 7.0287 16.8584 29.3429 43.4584 67.5311
frequency: 28.9166 43.3812 67.5024 76.8599 93.1113 111.0932 123.6424 128.4474 138.3099 171.8927 182.2846 205.9586 222.7459 228.9213 231.5330 241.8458 245.7945 254.5528 273.4160 280.4767 284.4981 300.9309 313.7225 320.0326 326.3955 334.1130 343.8471 356.0862 370.5816 383.5701 399.4389 409.0017 418.9419 434.1339 442.1844 451.2378 463.0756 467.9917 482.7137 510.4376 537.7606 571.9083 585.6143 588.4846 599.5354 622.6272 640.2858 713.3431 731.8636 785.5461 793.2378 812.7436 825.8705 841.3317 878.8543 885.3194 896.4296 909.1109 911.9535 916.9762 936.0447 944.9490 949.7572 952.9398 959.3756 980.4127 986.8253 992.3028 1002.6307 1011.4048 1020.6541 1029.5865 1032.7329 1048.3141 1050.6992 1060.5425 1069.9239 1087.8385 1095.0012 1100.2086 1107.2806 1109.2330 1132.0656 1139.5802 1142.6795 1147.1727 1156.4167 1166.9819 1175.7335 1184.6276 1196.4476 1211.7383 1216.9011 1222.3154 1236.8486 1241.1447 1252.2356 1259.9524 1268.0196 1271.2773 1282.1837 1288.1365 1295.7240 1299.8458 1307.1460 1313.6077 1316.7118 1323.8196 1330.1551 1333.7559 1337.1077 1340.5256 1344.5271 1348.1501 1353.6422 1355.1748 1365.5577 1368.3206 1372.8466 1393.1362 1400.7619 1411.7333 1436.2271 1438.1074 1461.7668 1462.7174 1465.5909 1466.7512 1469.0129 1475.5295 1476.9933 1477.2688 1485.6419 1487.5929 1490.7890 1492.1317 1621.9223 2873.1393 2921.7928 2926.0317 2936.9904 2956.6797 2960.9633 2963.2473 2967.6804 2974.4165 2979.3333 2980.5952 2990.7925 2994.1168 2995.4308 2997.2758 3016.0844 3019.7370 3031.6503 3032.0799 3036.9054 3052.0939 3055.2146 3056.5054 3062.6135 3078.3671 3078.7412 3079.8908 3082.1114 3082.7752 3098.8052 3126.9054 3540.5836 3548.8954 3565.0897
redmass: 5.5008 4.4599 4.6005 4.2186 3.4972 3.2087 1.8684 1.4131 2.7621 2.5588 4.0839 3.3266 1.7784 1.5392 1.4662 1.5021 1.6738 1.9185 2.2301 2.7392 1.5949 1.9412 1.8770 2.2552 2.2676 2.7272 2.9899 3.0113 3.7916 3.4344 3.2717 3.0615 2.8845 3.4084 2.6898 2.3702 3.1172 2.5059 3.3508 3.2161 3.5051 3.3605 3.1553 2.5059 3.2723 2.6823 3.2273 3.4158 2.4181 1.8541 1.9807 2.1852 1.9920 2.5464 2.4366 2.1589 2.1513 2.2732 1.8997 2.3890 2.5939 2.1043 2.0836 2.0290 1.8106 2.3404 2.8067 2.2269 2.3664 2.1737 1.7477 1.9621 1.8517 2.4483 2.2292 2.5923 1.9778 2.0795 1.9895 2.4986 1.6496 1.5207 2.3339 1.4263 2.0505 1.7152 1.5738 1.9181 1.9849 2.3860 1.6901 1.3659 1.6355 1.6608 1.8280 1.4230 1.4106 1.4041 1.3582 1.4314 1.4081 1.3920 1.4284 1.4350 1.3523 1.3599 1.3788 1.3600 1.3502 1.3658 1.8626 1.4735 1.4419 1.4439 1.4364 1.4607 1.4296 1.2586 1.1754 1.2722 1.5464 1.1797 1.0595 1.0820 1.0856 1.0738 1.0801 1.0792 1.0785 1.0920 1.0918 1.0836 1.0542 1.0595 1.0658 1.0617 8.1209 1.0795 1.0834 1.0801 1.0812 1.0698 1.0642 1.0638 1.0609 1.0586 1.0477 1.0723 1.0615 1.0430 1.0355 1.0573 1.0637 1.0977 1.0948 1.1003 1.0960 1.0992 1.0928 1.1000 1.0964 1.0982 1.0979 1.0945 1.1024 1.0909 1.0983 1.1028 1.0658 1.0659 1.0657
irintensity: 0.6686 1.7003 2.5086 1.8968 0.2911 3.8106 0.9886 0.1813 2.2646 0.2390 2.7151 1.5842 1.9985 1.7189 18.4224 117.4440 44.5909 14.7432 40.1726 24.1017 57.1680 24.3457 22.5975 34.7333 85.2809 14.8042 6.5158 8.7220 1.3944 2.6789 8.1558 4.0927 3.2080 3.5287 4.0043 3.7496 4.7402 1.7500 6.2949 9.0467 5.4120 5.1640 8.3857 5.9147 17.9270 4.0007 1.2126 0.6703 0.2607 1.5563 1.0419 8.4842 2.2565 4.0685 15.4451 7.4244 13.6839 0.4838 0.3979 0.4290 76.7492 14.2815 15.9253 14.2189 27.6537 0.2784 32.7385 39.3772 10.4002 24.9066 3.3933 7.0300 5.0794 10.0314 2.5905 2.3335 6.6913 15.4041 27.4569 4.4760 17.5689 10.3124 11.6723 19.1297 4.5397 22.9908 4.5420 96.6748 5.2943 5.4157 22.4900 8.5936 8.5505 9.6560 9.7824 16.4025 4.3205 16.3192 2.9872 6.6372 7.2214 6.0637 1.2746 3.7711 2.5454 2.2928 1.5222 6.6297 8.9398 0.7999 37.3037 0.8112 4.4956 20.4459 1.8217 1.6906 5.3852 56.8265 33.2448 15.2865 6.0391 32.8424 17.7795 21.4918 3.5678 3.6811 6.4780 8.1959 30.6506 5.0478 0.4596 21.7971 7.0035 5.6655 7.8107 13.4538 96.4758 28.6185 32.6437 17.0356 28.5812 56.4954 28.0123 22.3653 20.7020 35.2359 54.9354 36.6223 36.6857 16.9079 2.0874 30.8324 18.7175 40.1714 24.2442 53.2375 49.8028 65.5705 29.4438 31.8833 59.2391 32.4884 27.9897 5.1910 22.9564 11.6199 18.1481 16.6378 5.1862 2.1447 3.0934
temp: 298.150 k
press: 1.00000 atm
elementType: 8 8 8 8 6 6 6 6 6 6 6 6 6 6 6 6 6 6 6 6 6 6 6 6 6 1 1 1 1 1 1 1 1 1 1 1 1 1 1 1 1 1 1 1 1 1 1 1 1 1 1 1 1 1 1 1 1 1 1
symmnumber: 1
zpe: 1352482.2 jmol-1
zpe.correction: 0.515133 hartree
zpe.thermalcorrener: 0.540341 hartree
zpe.thermalcorrenthalpy: 0.541285 hartree
zpe.thermalcorrgfe: 0.463397 hartree
zpe.sumelectzpe: -1119.536942 hartree
zpe.sumelectthermal: -1119.511734 hartree
zpe.sumelectthermalent: -1119.510790 hartree
zpe.sumelectthermalfe: -1119.588678 hartree
dipole: 2.7364 3.0194 -1.1153
dipole: 4.2248
quadrupole: -171.0801 -155.3005 -154.8294
quadrupole: 11.9812 7.4070 -2.5884
quadrupole: -10.6768 5.1029 5.5739 11.9812 7.4070 -2.5884
hfenergy: -1120.0520749 hartree
pointgroup: C01 [X(C21H34O4)]
dipole: -1.0443431 1.2220748 0.4226263 debye
polarizability: 264.521687|-3.273309|215.4355116|-5.9192331|-1.8094386|198.9976905 unknown
InChI: InChI=1S/C21H34O4/c1-12(22)21(25)9-7-16-15-5-4-13-10-14(23)6-8-19(13,2)18(15)17(24)11-20(16,21)3/h13-18,23-25H,4-11H2,1-3H3
charge 0 multiplicity 1
59 atoms
O  -0.738502 -2.742503 -0.632557
O  3.124268 -0.524531 1.937609
O  -4.865362 -0.618916 2.577124
O  5.326269 -0.071789 -0.804107
C  -1.010847 -0.225601 -0.347919
C  -0.214074 1.131515 -0.463801
C  1.143604 1.006734 0.253089
C  2.04759 -0.125286 -0.328307
C  -2.429254 -0.118707 -1.047548
C  -3.210816 1.125694 -0.472465
C  -0.11483 -1.412397 -0.83689
C  1.292359 -1.458838 -0.177896
C  3.336649 0.065101 0.593799
C  -1.026406 2.326934 0.087025
C  2.08578 2.233182 0.322962
C  -2.404585 2.44138 -0.593768
C  3.483011 1.620308 0.674985
C  -3.344483 -1.370494 -0.821827
C  -3.689536 0.90885 0.992329
C  2.433629 0.113723 -1.813411
C  -2.274793 0.029994 -2.588706
C  -3.794905 -1.590328 0.638747
C  -4.545522 -0.360394 1.156813
C  4.594066 -0.643859 0.048223
C  4.896153 -2.039086 0.558368
H  -1.182719 -0.393254 0.740519
H  -0.021014 1.336429 -1.537237
H  0.895642 0.71209 1.303246
H  -4.125193 1.224858 -1.099401
H  -0.005297 -1.36602 -1.933967
H  1.180254 -1.69627 0.90063
H  1.842696 -2.299815 -0.640599
H  -0.45458 3.261316 -0.072043
H  -1.146988 2.217516 1.184682
H  1.756265 2.975071 1.07086
H  2.117881 2.749224 -0.65516
H  -2.983099 3.274847 -0.147376
H  -2.261779 2.695029 -1.662611
H  4.262899 1.949068 -0.032184
H  3.823561 1.897436 1.689105
H  -2.834228 -2.271989 -1.195225
H  -4.25212 -1.221975 -1.446522
H  -2.833667 0.825606 1.688265
H  -4.270993 1.801069 1.308723
H  3.082791 0.994679 -1.945133
H  2.989911 -0.754195 -2.209964
H  1.54116 0.248939 -2.447791
H  -1.580484 0.834922 -2.886366
H  -1.915369 -0.912383 -3.040653
H  -3.256896 0.255309 -3.04634
H  -4.448402 -2.479466 0.708925
H  -2.931673 -1.77568 1.307603
H  -5.489912 -0.238401 0.577377
H  -0.821915 -2.897832 0.343554
H  2.427668 0.002941 2.40336
H  5.151417 -1.988647 1.632416
H  4.002997 -2.685852 0.493539
H  5.733357 -2.470983 -0.011438
H  -5.351634 0.164625 2.94104
