program: Gaussian 09
title: 000222809
version: EM64L-G09RevD.01
frameworkgroup: C1[X(C21H32O4)]
method: RPBEPBE
basis: SDD
operation: Freq
keyword: #pfreq=noraman
keyword: PBEPBE/SDD
title: #p freq=noraman PBEPBE/SDD
converged: NO YES NO NO
title: Mulliken charges:
elementType: O O O O C C C C C C C C C C C C C C C C C C C C C H H H H H H H H H H H H H H H H H H H H H H H H H H H H H H H H
charge: -0.461666 -0.468955 -0.245108 -0.202224 -0.173795 -0.095984 -0.172957 0.394359 0.372994 -0.132982 -0.655511 0.127932 -0.034477 -0.572332 -0.487568 -0.495262 -0.511882 -0.475273 -0.872128 -0.811708 -0.618438 -0.549548 0.140572 0.170761 -0.794867 0.258914 0.260852 0.195535 0.208621 0.244531 0.230837 0.191513 0.224331 0.233034 0.217666 0.211414 0.227855 0.246126 0.202675 0.211875 0.207651 0.224838 0.288607 0.217152 0.209116 0.195630 0.211911 0.280430 0.239297 0.241876 0.241589 0.231524 0.340340 0.358785 0.264799 0.248576 0.258142
chargesum: 0.00000
title: Mulliken charges with hydrogens summed into heavy atoms:
elementType: O O O O C C C C C C C C C C C C C C C C C C C C C
charge: -0.121326 -0.110169 -0.245108 -0.202224 0.085119 0.164869 0.022577 0.394359 0.372994 0.075639 -0.180143 0.127932 0.157036 -0.114966 -0.058488 -0.021281 -0.097331 -0.042783 -0.157253 -0.123737 -0.137265 -0.076436 0.140572 0.170761 -0.023349
polarizability: 2.73703083e+02 -3.12082061e+00 2.09287545e+02 -7.83700941e+00 -3.73003161e+00 1.94782510e+02
1716.lowfreq: -4.9646 -0.0006 -0.0004 0.0002 4.4441 18.3293 26.3214 43.4824 52.5583
frequency: 26.1796 43.4744 52.4689 63.4208 93.4643 118.6233 120.9206 147.5957 154.5921 175.3510 186.4891 196.1971 211.9188 216.4243 226.4095 248.0539 263.6818 275.1774 290.7548 305.2982 312.1386 319.4244 334.5321 348.5487 360.5321 361.0872 367.5858 374.5758 390.1994 421.6914 426.1320 434.0694 457.0792 479.8291 493.7853 502.3361 521.0194 526.5275 533.4958 540.2651 570.7818 592.1168 599.1758 632.5036 639.3461 661.6795 737.9669 743.8172 752.5451 787.4607 791.4380 817.7933 821.3711 857.1536 871.5456 882.9241 898.1960 910.3164 921.3365 929.5279 936.0433 946.9788 957.7507 963.3461 965.1408 982.5458 1004.5456 1013.2503 1016.9865 1021.1773 1033.8702 1042.4491 1053.5497 1062.5919 1074.0351 1077.0169 1095.5490 1108.7691 1112.8719 1125.4984 1129.0703 1134.2938 1148.9816 1153.2089 1163.6277 1181.4238 1187.8113 1198.1567 1213.1839 1218.3401 1225.7680 1236.9127 1243.0886 1248.1979 1255.3336 1263.9529 1268.6148 1270.6373 1280.3418 1292.7634 1301.8483 1304.4450 1310.9163 1325.2250 1330.1991 1335.2102 1337.9578 1347.8600 1349.0569 1352.9145 1353.9969 1372.0709 1374.0802 1375.3215 1382.7519 1391.2881 1398.8581 1430.4416 1442.6852 1446.5323 1448.1826 1457.9882 1462.5268 1466.3945 1467.9154 1470.8459 1475.5942 1476.2284 1488.8444 1499.6453 1504.3205 1584.7742 1634.4940 2903.8608 2945.1206 2948.1028 2949.4971 2954.5614 2961.8763 2967.8172 2971.4458 2972.1155 2977.0355 2978.8131 2979.6848 2980.3082 2988.5828 2994.3782 3020.4372 3024.6628 3030.6084 3034.2032 3038.6698 3045.7779 3059.9741 3060.1836 3063.5878 3064.7218 3081.5750 3091.1584 3105.3311 3116.2780 3128.6314 3402.6277 3550.6546
redmass: 6.4125 4.8839 5.6036 6.7141 3.1167 3.1854 2.3116 3.4386 1.2759 2.6935 2.7602 2.2899 2.9056 2.6536 2.7030 1.9881 2.7854 2.8558 1.7729 1.7125 2.4110 2.3898 1.2076 2.4326 2.6025 3.1315 3.0312 4.1361 3.6334 3.7509 2.8961 2.9056 3.2695 3.1600 2.7303 3.4518 2.1821 2.5530 2.3775 1.4604 2.7766 2.4761 3.2301 4.1558 2.6181 2.8360 3.3205 2.8941 3.4034 2.7848 1.9277 2.1758 2.3980 2.5101 2.1640 1.9576 1.9818 2.0580 2.2985 2.3264 2.3923 2.0520 2.3697 2.0335 2.0061 2.1305 1.9652 2.1297 2.2432 1.8629 1.9854 2.0512 2.1592 2.3972 2.3791 2.1208 1.7718 1.3556 2.2693 2.1104 1.8745 2.4761 1.6057 1.6641 1.8345 1.9867 1.5856 2.1638 1.7257 1.6231 2.0950 1.4668 1.7352 1.6284 1.4772 1.4408 1.6414 1.4298 1.3339 1.4221 1.3255 1.4862 1.4478 1.4281 1.4352 1.3806 1.4173 1.4007 1.3989 1.4639 1.5077 1.3775 1.2483 1.3815 1.3679 1.2923 1.1988 1.0798 1.0811 1.0813 1.0704 1.0740 1.0631 1.0832 1.0777 1.0839 1.0757 1.0682 1.0777 1.0551 1.0533 7.2599 10.6785 1.0794 1.0771 1.0787 1.0802 1.0657 1.0697 1.0666 1.0637 1.0489 1.0603 1.0807 1.0404 1.0632 1.0412 1.0636 1.0972 1.0619 1.1001 1.0944 1.0977 1.0952 1.0950 1.0982 1.0978 1.0955 1.0898 1.1030 1.0964 1.0968 1.1020 1.0640 1.0657
irintensity: 0.8529 1.5801 3.6954 2.1039 0.4333 1.9208 0.1632 2.0469 0.4536 1.0159 1.1356 4.6514 1.4108 0.2713 10.9864 3.4298 0.7394 7.2944 39.4452 68.2428 7.4787 10.0836 19.3043 12.3357 2.8053 3.4865 1.1459 14.9945 12.1884 1.5873 1.0294 3.2762 0.3828 4.4761 2.8432 7.7079 4.7188 13.5009 17.6818 81.8712 5.6073 16.3463 17.9525 10.2181 9.1198 13.1933 2.3492 3.3550 0.8244 4.9609 5.0272 2.1574 0.9496 15.7391 3.2948 0.1198 6.9075 2.4606 18.1331 6.3679 8.0889 3.5000 11.8859 5.0996 8.4464 7.4114 2.1464 5.1225 7.1948 12.3285 9.0041 6.8520 9.5900 12.7304 25.4310 29.3653 11.5356 8.2978 18.8878 7.7282 10.3125 12.3451 14.9522 13.1485 8.8693 15.2383 20.8362 14.4647 48.3698 1.5695 39.7445 38.9733 10.5097 15.9332 10.6959 2.7692 1.7093 1.8268 23.9545 19.4741 2.5184 9.6798 17.8242 2.6178 0.7470 4.0485 3.0606 3.0865 3.5910 45.1447 26.4605 10.0738 53.6395 6.5854 3.2978 20.7478 32.2445 13.4552 16.2266 28.4153 16.4576 7.6934 7.2158 4.5342 10.7388 13.4301 2.6097 25.5133 0.8808 11.2043 5.5478 94.6239 224.6247 12.7172 31.9502 19.0505 6.0203 12.6451 38.5374 48.2183 10.8342 8.0058 61.7512 27.8169 36.5096 71.6806 1.5591 24.3400 36.8658 33.4224 48.3544 23.0930 36.7538 18.7898 59.0565 27.0605 16.7245 18.2389 9.3390 21.9614 11.5803 7.0902 8.3685 50.6318 4.4018
temp: 298.150 k
press: 1.00000 atm
elementType: 8 8 8 8 6 6 6 6 6 6 6 6 6 6 6 6 6 6 6 6 6 6 6 6 6 1 1 1 1 1 1 1 1 1 1 1 1 1 1 1 1 1 1 1 1 1 1 1 1 1 1 1 1 1 1 1 1
symmnumber: 1
zpe: 1294010.8 jmol-1
zpe.correction: 0.492863 hartree
zpe.thermalcorrener: 0.517073 hartree
zpe.thermalcorrenthalpy: 0.518017 hartree
zpe.thermalcorrgfe: 0.441574 hartree
zpe.sumelectzpe: -1118.363809 hartree
zpe.sumelectthermal: -1118.339599 hartree
zpe.sumelectthermalent: -1118.338655 hartree
zpe.sumelectthermalfe: -1118.415098 hartree
dipole: 3.9983 -0.0679 -4.2450
dipole: 5.8319
quadrupole: -170.8829 -146.7077 -164.8619
quadrupole: 6.2893 3.0927 -2.4060
quadrupole: -10.0654 14.1097 -4.0444 6.2893 3.0927 -2.4060
hfenergy: -1118.8566719 hartree
pointgroup: C01 [X(C21H32O4)]
dipole: -1.639157 0.1197401 -1.6010115 debye
polarizability: 274.2733438|-2.4188193|208.5832096|4.4257774|4.9421305|194.9165847 unknown
InChI: InChI=1S/C21H32O4/c1-12(22)21(25)9-7-16-15-5-4-13-10-14(23)6-8-19(13,2)18(15)17(24)11-20(16,21)3/h13,15-18,24-25H,4-11H2,1-3H3
charge 0 multiplicity 1
57 atoms
O  -0.135523 2.311884 -1.184561
O  -2.878164 -0.672152 2.249749
O  -4.68691 1.201806 1.879263
O  5.668942 -0.310085 1.992696
C  0.142246 -0.858933 -0.803163
C  -1.18023 -1.100251 -0.043319
C  0.901904 0.316492 -0.104349
C  -2.113238 0.146847 0.008833
C  2.354067 0.596614 -0.667226
C  0.024566 1.587369 0.103852
C  -1.361347 1.2800 0.736726
C  -3.31497 -0.491283 0.854202
C  3.17985 -0.74985 -0.700892
C  -2.118164 -2.253537 -0.473626
C  1.010812 -2.140146 -0.763573
C  -3.477348 -1.913715 0.23154
C  2.407669 -1.913977 -1.368994
C  3.069329 1.610937 0.30435
C  -2.593238 0.584613 -1.40018
C  2.371293 1.182484 -2.10725
C  3.74913 -1.112635 0.693446
C  4.573936 1.31987 0.522375
C  -4.569815 0.407539 0.896987
C  4.763117 -0.060699 1.154538
C  -5.657811 0.321976 -0.153961
H  -0.063419 -0.59733 -1.861474
H  -0.90283 -1.303488 1.014269
H  1.06395 -0.041083 0.941264
H  0.560312 2.265953 0.801841
H  -1.197039 0.968053 1.786011
H  -1.959546 2.215649 0.768359
H  4.059302 -0.552635 -1.350661
H  -1.737424 -3.240504 -0.16065
H  -2.235651 -2.280496 -1.573772
H  0.497328 -2.956432 -1.3072
H  1.102414 -2.47599 0.291364
H  -4.319652 -1.959366 -0.480122
H  -3.696414 -2.612734 1.055804
H  3.010887 -2.840696 -1.294777
H  2.297598 -1.701014 -2.45089
H  2.581997 1.585871 1.300266
H  2.939579 2.639692 -0.079263
H  -1.729473 0.821755 -2.039631
H  -3.188434 -0.200405 -1.899897
H  -3.213958 1.499134 -1.341673
H  3.417809 1.378613 -2.414995
H  1.935645 0.483785 -2.844173
H  1.797605 2.118628 -2.161406
H  4.244925 -2.101117 0.695287
H  2.945015 -1.17103 1.456645
H  5.053901 2.076439 1.168011
H  5.114091 1.337668 -0.4471
H  -0.806781 3.027841 -1.046421
H  -3.236053 0.116004 2.751846
H  -5.258635 0.217542 -1.174695
H  -6.274236 -0.576419 0.047848
H  -6.308515 1.208048 -0.085875
