program: Gaussian 09
title: 000222808
version: EM64L-G09RevD.01
frameworkgroup: C1[X(C21H32O3)]
method: RPBEPBE
basis: SDD
operation: Freq
keyword: #pfreq=noraman
keyword: PBEPBE/SDD
title: #p freq=noraman PBEPBE/SDD
converged: YES YES NO NO
title: Mulliken charges:
elementType: O O O C C C C C C C C C C C C C C C C C C C C C H H H H H H H H H H H H H H H H H H H H H H H H H H H H H H H H
charge: -0.466699 -0.220141 -0.205058 -0.145739 -0.133545 -0.121196 0.403159 0.324708 -0.193709 -0.602588 -0.072377 -0.223005 -0.518274 -0.551967 -0.477489 -0.471150 -0.444936 -0.841643 -0.811515 -0.598341 -0.540096 0.149312 0.166932 -0.767811 0.234106 0.211842 0.214863 0.222970 0.214981 0.234402 0.206971 0.245623 0.221399 0.214101 0.215436 0.237574 0.201401 0.216180 0.225110 0.211005 0.244116 0.194994 0.217933 0.222179 0.262623 0.217777 0.218737 0.223187 0.238545 0.233261 0.253668 0.233131 0.343499 0.238726 0.237158 0.255676
chargesum: 0.00000
title: Mulliken charges with hydrogens summed into heavy atoms:
elementType: O O O C C C C C C C C C C C C C C C C C C C C C
charge: -0.123200 -0.220141 -0.205058 0.088366 0.078297 0.093667 0.403159 0.324708 0.029260 -0.153205 0.134594 0.022617 -0.082774 -0.098957 -0.059908 -0.035035 -0.005827 -0.138908 -0.151815 -0.126536 -0.053296 0.149312 0.166932 -0.036251
polarizability: 2.66457496e+02 -2.16206123e+00 2.12498473e+02 -2.85798016e+00 -3.88498616e+00 1.84162295e+02
1716.lowfreq: -22.9332 -8.4975 -3.6425 -0.0010 -0.0008 -0.0007 25.9412 42.8870 49.1021
frequency: 25.7809 42.8779 49.0368 66.7505 89.9027 95.1244 112.8460 121.3394 136.0794 149.5987 163.4522 185.6787 211.5210 220.0198 231.6231 247.1732 256.7669 269.4290 287.5918 302.9396 306.2801 317.0504 322.6688 338.1412 359.8211 371.9746 392.6807 395.4289 411.6504 424.9909 437.6758 454.0202 477.3686 492.8009 501.3014 516.1513 538.3978 556.5975 585.7479 599.2647 632.9580 644.5727 668.9262 722.5759 734.5128 765.6899 808.8239 815.5488 822.2053 836.8207 865.7414 874.5978 883.3061 908.0594 911.3097 932.7968 945.7665 948.8204 951.2138 957.6146 980.6749 983.9016 1001.5877 1004.6620 1010.1775 1020.3720 1024.2142 1035.4352 1041.7674 1048.2208 1064.0655 1068.0564 1087.3383 1095.5503 1105.4960 1114.6261 1131.5799 1134.0909 1149.3491 1156.7813 1163.9362 1181.9872 1189.7031 1197.3793 1207.8621 1212.9165 1222.4737 1230.3326 1240.5178 1247.2489 1249.4239 1257.7599 1261.8790 1264.5127 1276.7694 1282.4078 1287.5711 1298.3628 1306.1773 1308.8396 1314.1759 1315.6505 1322.6369 1332.2525 1334.9981 1338.3230 1341.8643 1348.0505 1354.6560 1363.1962 1365.4684 1383.4069 1387.5422 1391.4794 1439.7986 1446.5144 1450.7849 1455.7284 1457.2266 1463.8306 1465.5802 1469.3058 1473.6933 1477.1393 1482.2950 1483.1277 1488.0187 1497.6005 1616.9386 1629.5456 2905.5729 2915.8476 2946.2095 2953.7998 2957.9596 2959.8721 2965.4941 2966.0773 2974.2137 2977.1996 2979.4296 2980.1872 2981.0957 2989.8554 2992.2824 2994.4175 3008.9251 3019.1382 3025.1445 3031.2513 3048.2832 3055.6287 3061.0130 3065.1746 3068.3546 3072.3589 3079.6946 3080.8408 3082.8938 3096.4255 3119.1666 3545.4503
redmass: 4.9189 4.4392 4.6411 4.7328 1.3336 2.5235 3.3655 2.4486 2.3588 2.7661 1.2540 2.9543 2.3109 1.9036 2.1329 2.8100 2.9152 2.8934 2.8332 1.3637 2.8052 2.5653 2.1834 2.8860 3.9113 2.4781 3.4316 2.9629 3.3331 3.6061 2.8165 2.5263 2.8231 3.1396 3.0532 2.8652 2.9613 2.9809 2.5549 2.9295 3.1700 2.5444 3.5857 2.5787 2.5625 2.2196 2.5663 2.9144 1.9283 1.5010 2.0357 2.0727 2.3905 2.0101 1.8085 2.0123 2.1842 3.0582 1.9216 2.4946 1.7690 1.8208 2.0031 1.7312 2.2454 2.5962 1.8895 2.0306 2.1655 2.3776 2.3549 1.9351 2.1720 1.8720 1.4158 2.4592 1.9034 2.0965 1.7662 1.8333 1.7078 1.5697 2.3950 1.7627 1.5012 1.2898 1.7546 1.5346 1.5102 1.6414 1.3935 1.4955 1.3955 1.6396 1.7326 1.3790 1.5845 1.3477 1.2855 1.4417 1.3303 1.4136 1.3665 1.5754 1.4858 1.3989 1.4537 1.4555 1.4642 1.4460 1.2905 1.4500 1.2252 1.2170 1.0766 1.0894 1.0544 1.0811 1.0854 1.0765 1.0800 1.0781 1.0871 1.0559 1.0689 1.0710 1.0656 1.0657 8.1816 9.2585 1.0809 1.0799 1.0791 1.0785 1.0684 1.0664 1.0725 1.0692 1.0657 1.0594 1.0702 1.0371 1.0502 1.0620 1.0573 1.0412 1.0625 1.0966 1.1013 1.1012 1.1022 1.0974 1.0979 1.0959 1.0984 1.1031 1.0927 1.0975 1.0967 1.0987 1.1005 1.0659
irintensity: 0.5737 4.5674 1.5269 1.8293 0.9853 2.5122 0.5826 3.1832 2.1838 0.8997 0.2546 0.0811 1.7168 0.5253 2.0729 5.3278 3.5709 1.5823 2.6319 83.0894 13.6345 4.4387 16.3251 0.4350 0.1553 4.7627 1.9272 2.6395 3.0054 0.4573 1.3229 1.3177 2.1607 1.2734 0.8395 7.0087 8.4264 4.9642 4.2102 21.3148 0.7865 1.6160 10.9178 1.1781 2.0857 8.0909 2.0515 3.0205 7.8211 2.0571 3.6202 7.8852 12.4214 0.9421 8.9867 6.5156 10.4434 27.6194 14.9386 8.3030 1.6308 1.7504 11.6982 4.4483 3.8266 4.7886 5.8008 4.2404 9.7124 6.7522 7.3409 4.9803 3.8749 3.8274 2.8073 8.1017 11.2220 6.4484 0.3359 13.5071 15.3832 26.9549 6.4171 33.9044 3.6266 7.6651 18.1051 27.2693 15.1049 20.6375 1.7780 27.7338 9.9483 12.1179 3.7737 11.7409 12.2635 6.6116 4.7656 2.0066 0.5026 11.3266 2.3671 20.0452 3.6195 14.6309 4.7121 8.1396 4.7544 8.6427 64.2529 1.7441 32.9426 24.1131 24.6970 13.4678 21.5510 10.7243 19.0647 18.2139 4.0813 10.0599 5.1550 10.6926 8.3489 4.8630 6.4100 9.4997 98.2332 219.8177 6.0584 22.6933 0.8368 10.2466 11.6745 12.8281 26.9247 34.4379 16.5813 20.6385 41.1311 2.4839 96.4962 26.2520 20.6737 36.6611 42.8980 48.4566 22.4024 79.7412 3.8638 24.2777 40.7077 6.3559 26.0681 67.4871 11.7450 28.5438 43.4057 12.5222 16.8089 4.6929
temp: 298.150 k
press: 1.00000 atm
elementType: 8 8 8 6 6 6 6 6 6 6 6 6 6 6 6 6 6 6 6 6 6 6 6 6 1 1 1 1 1 1 1 1 1 1 1 1 1 1 1 1 1 1 1 1 1 1 1 1 1 1 1 1 1 1 1 1
symmnumber: 1
zpe: 1282597.2 jmol-1
zpe.correction: 0.488515 hartree
zpe.thermalcorrener: 0.512223 hartree
zpe.thermalcorrenthalpy: 0.513168 hartree
zpe.thermalcorrgfe: 0.436993 hartree
zpe.sumelectzpe: -1043.229634 hartree
zpe.sumelectthermal: -1043.205926 hartree
zpe.sumelectthermalent: -1043.204982 hartree
zpe.sumelectthermalfe: -1043.281157 hartree
dipole: -5.4830 2.7783 1.0775
dipole: 6.2405
quadrupole: -174.9460 -145.3884 -147.8290
quadrupole: -6.4913 21.8879 -0.5749
quadrupole: -18.8915 10.6661 8.2255 -6.4913 21.8879 -0.5749
hfenergy: -1043.7181495 hartree
pointgroup: C01 [X(C21H32O3)]
dipole: 2.1526723 1.0906351 -0.4521967 debye
polarizability: 266.4539573|2.3674563|212.7564944|-2.6116771|2.9024392|183.9078123 unknown
InChI: InChI=1S/C21H32O3/c1-12(22)16-6-7-17-15-5-4-13-10-14(23)8-9-20(13,2)19(15)18(24)11-21(16,17)3/h13,15-19,24H,4-11H2,1-3H3
charge 0 multiplicity 1
56 atoms
O  -0.675709 -2.679342 0.146272
O  4.666352 -1.802335 -0.123956
O  -5.42132 -0.284653 1.89198
C  -0.065278 1.075243 -0.495927
C  -0.86155 -0.253848 -0.198626
C  1.29044 1.052138 0.232701
C  2.191429 -0.15032 -0.183067
C  -2.256251 -0.250011 -0.95385
C  0.026046 -1.510175 -0.445829
C  1.43418 -1.435511 0.202637
C  -3.063554 1.036551 -0.53542
C  3.45392 0.170148 0.676157
C  -0.893162 2.320965 -0.098729
C  2.232065 2.281236 0.126749
C  -2.273835 2.343759 -0.786647
C  3.651049 1.721984 0.497957
C  -3.16596 -1.480292 -0.634644
C  2.552229 -0.151165 -1.694538
C  -2.056537 -0.259254 -2.49766
C  -3.56283 0.984588 0.9434
C  -3.630577 -1.581249 0.840449
C  4.703023 -0.689863 0.471466
C  -4.312971 -0.299227 1.288235
C  6.005778 -0.16718 1.069555
H  0.130307 1.142721 -1.585812
H  -1.06299 -0.259099 0.895528
H  1.065935 0.9096 1.316315
H  0.138811 -1.681754 -1.537175
H  1.296219 -1.470936 1.303848
H  2.018893 -2.33152 -0.087407
H  -3.971321 1.054762 -1.176606
H  3.174007 -0.000794 1.743048
H  -0.330819 3.23622 -0.366868
H  -1.011486 2.343001 1.004807
H  1.924879 3.10059 0.799814
H  2.230451 2.68852 -0.901848
H  -2.865467 3.209435 -0.427634
H  -2.135917 2.489787 -1.87626
H  4.375605 1.933155 -0.309826
H  4.049813 2.186168 1.417147
H  -2.643128 -2.412884 -0.899033
H  -4.064324 -1.400966 -1.283135
H  1.655109 -0.219609 -2.333086
H  3.097185 0.763135 -1.991575
H  3.195502 -1.018327 -1.919569
H  -3.031438 -0.130427 -3.004858
H  -1.38848 0.540231 -2.8603
H  -1.640035 -1.226128 -2.835188
H  -4.221558 1.846385 1.15422
H  -2.698092 1.05738 1.634302
H  -2.741428 -1.769721 1.474575
H  -4.324825 -2.427841 0.982988
H  -0.048932 -3.447528 0.139208
H  6.389227 0.672957 0.458815
H  5.847869 0.225715 2.090789
H  6.761453 -0.968011 1.08381
