program: Gaussian 09
title: 000222800
version: EM64L-G09RevD.01
frameworkgroup: C1[X(C21H28O4)]
method: RPBEPBE
basis: SDD
operation: Freq
keyword: #pfreq=noraman
keyword: PBEPBE/SDD
title: #p freq=noraman PBEPBE/SDD
converged: YES YES NO NO
title: Mulliken charges:
elementType: O O O O C C C C C C C C C C C C C C C C C C C C C H H H H H H H H H H H H H H H H H H H H H H H H H H H H
charge: -0.193098 -0.441714 -0.207663 -0.226999 -0.085490 0.320803 -0.164393 -0.259121 -0.203165 0.221671 -0.558386 -0.659031 -0.514984 -0.479358 0.145534 0.527671 -0.353096 -0.801582 -0.489115 -0.815599 0.155473 -0.563658 -0.590127 0.177638 -0.800476 0.210169 0.290608 0.226772 0.233604 0.215503 0.244914 0.229661 0.250699 0.255461 0.220983 0.268097 0.212044 0.233098 0.250235 0.233110 0.234894 0.202165 0.268968 0.245772 0.269669 0.214460 0.250440 0.238513 0.257380 0.349465 0.244044 0.248898 0.258640
chargesum: 0.00000
title: Mulliken charges with hydrogens summed into heavy atoms:
elementType: O O O O C C C C C C C C C C C C C C C C C C C C C
charge: -0.193098 -0.092249 -0.207663 -0.226999 0.124679 0.320803 0.126215 -0.032349 0.030439 0.221671 -0.097969 -0.178671 -0.038541 0.000783 0.145534 0.527671 -0.119999 -0.083343 -0.017982 -0.085699 0.155473 -0.074705 -0.332747 0.177638 -0.048894
polarizability: 3.00223004e+02 -7.78862323e+00 2.13239244e+02 -1.08630210e+01 -3.76755385e-01 1.76408114e+02
1716.lowfreq: -1.6667 -0.0001 0.0002 0.0009 8.0457 10.0602 29.9217 40.4243 61.4409
frequency: 29.8521 40.3753 61.4266 65.8418 87.1283 92.6140 111.4037 117.1502 142.0928 154.5040 162.0121 177.2587 200.5162 217.2567 225.7336 239.2383 253.4465 259.1303 265.1443 271.5061 280.5184 296.7527 324.0708 330.1994 345.8260 356.1778 361.4266 372.9999 389.4649 410.6690 446.0576 458.8488 482.8869 491.1186 502.0743 552.3517 558.0946 576.0237 588.0087 611.7480 618.2724 634.8109 669.0921 690.9563 718.9304 731.2362 748.7908 784.6885 799.1177 824.0002 834.9811 847.1946 887.9239 898.9163 908.8045 910.6670 920.4902 936.3127 939.0748 950.6091 955.7861 967.9970 979.1508 996.9965 1005.3932 1021.1365 1030.1124 1036.2469 1043.4808 1050.6221 1064.8744 1084.9389 1093.3470 1104.6542 1115.9920 1128.6056 1137.0945 1145.7744 1162.0949 1174.9864 1183.8770 1188.7277 1193.1778 1203.5796 1211.6943 1220.0858 1227.3333 1235.6129 1239.0239 1265.3883 1266.1864 1275.1519 1276.8185 1288.5116 1291.4573 1295.9962 1309.5830 1321.1628 1326.3555 1327.9241 1336.3273 1342.9672 1347.5955 1349.3463 1364.6985 1369.0430 1374.4022 1385.8906 1412.9294 1440.4050 1441.3206 1445.3820 1445.7571 1453.7381 1468.5501 1475.3156 1481.3382 1484.1546 1486.6404 1494.3770 1495.3359 1585.2630 1616.7761 1619.9385 1625.2292 2899.4749 2907.7235 2963.3563 2963.3641 2969.9334 2971.5424 2978.4804 2981.5113 2982.0292 2991.5991 2995.7254 2999.4955 3016.5920 3020.3589 3054.0808 3056.3629 3058.9416 3061.4845 3062.3556 3075.2500 3080.1377 3080.8791 3085.6681 3099.7651 3105.6365 3114.3227 3120.2422 3553.5397
redmass: 7.1513 4.3684 5.2921 3.7103 3.2092 4.9398 4.9968 1.0588 3.3629 3.5467 3.8845 4.0012 3.1907 2.4577 2.2391 1.5708 2.1704 1.8329 2.8143 2.9862 3.0334 3.0342 3.1736 3.3530 1.3551 2.8522 2.7581 2.7186 2.7515 3.6776 3.0239 2.5834 3.4749 4.3680 3.6481 2.9052 3.3861 3.5574 3.4883 3.0667 3.7167 4.4892 2.6075 3.8345 3.7840 3.1560 2.6728 2.7793 2.8781 3.0466 1.7697 2.1961 2.2746 1.5453 2.5573 2.8138 3.0151 2.1095 2.0855 1.8895 1.7796 2.0364 2.0117 2.3070 2.1553 2.3063 1.8699 1.9115 2.0820 2.4064 2.9281 1.7726 1.9163 2.2610 2.5930 1.6626 1.9545 2.1550 1.7287 1.6204 1.6251 1.9248 2.0110 1.5690 1.6737 1.3756 1.7566 1.4099 1.5220 1.3448 1.4999 1.9853 1.4110 1.5350 1.5592 1.4932 1.4384 1.4786 1.3828 1.4440 1.6063 1.5286 1.5241 1.6070 1.5064 1.2529 1.4878 1.2449 1.1870 1.0773 1.0831 1.0874 1.0764 1.0600 1.0642 1.0799 1.0668 1.0626 1.0585 1.0807 1.0578 10.3027 9.0273 7.6215 7.4330 1.0792 1.0809 1.0687 1.0733 1.0695 1.0784 1.0414 1.0643 1.0706 1.0384 1.0358 1.0603 1.0632 1.0824 1.1010 1.0988 1.0975 1.0946 1.0945 1.0985 1.0938 1.1038 1.0973 1.0986 1.0909 1.1009 1.1005 1.0663
irintensity: 1.6923 3.5501 1.8210 1.9941 2.3261 4.5712 1.8949 1.0035 1.2567 0.8359 2.2504 0.3197 0.1184 1.5654 1.3465 3.3749 9.9474 2.9207 7.9206 4.0121 0.9547 1.9776 0.1530 0.8005 108.9122 22.3319 6.3509 9.9506 14.1057 1.8853 6.6672 0.4180 5.5134 4.2529 7.6056 6.7504 1.6347 11.0784 0.8928 5.4521 1.7968 0.8158 3.0675 14.7601 8.6102 1.8757 3.1083 10.9838 2.4300 8.9905 3.6601 1.0533 22.5057 7.5095 12.0858 0.8038 7.4520 3.8868 4.9091 18.1571 9.0005 1.6977 2.1352 32.8368 1.7292 2.8917 5.4145 2.7655 7.2112 6.6907 36.3072 1.7388 11.4430 10.3236 8.2171 1.8387 8.1639 1.9340 70.7915 28.1360 5.3415 9.9720 32.9555 25.3093 37.3707 61.7117 29.0002 13.9399 34.8849 26.6217 14.8265 25.0413 20.7321 2.8314 11.7730 15.0125 7.3802 11.2767 9.8457 10.4741 19.8765 8.0915 10.2606 10.0023 2.2114 73.9365 22.3192 24.0860 29.1933 22.7662 9.6172 9.3862 15.9524 11.6443 12.9326 8.9235 3.3801 3.4087 11.0405 9.9492 11.8041 148.7624 104.3417 181.5012 82.3654 7.2626 25.2649 18.2775 16.5207 17.7652 27.1943 10.4655 17.8475 52.8831 8.0695 21.6353 28.6682 35.0257 12.4865 15.2080 21.9749 17.0803 18.7558 11.3325 32.9024 7.1138 33.6714 26.0593 15.0952 10.4512 4.5171 14.7003 8.2611
temp: 298.150 k
press: 1.00000 atm
elementType: 8 8 8 8 6 6 6 6 6 6 6 6 6 6 6 6 6 6 6 6 6 6 6 6 6 1 1 1 1 1 1 1 1 1 1 1 1 1 1 1 1 1 1 1 1 1 1 1 1 1 1 1 1
symmnumber: 1
zpe: 1173556.5 jmol-1
zpe.correction: 0.446984 hartree
zpe.thermalcorrener: 0.470968 hartree
zpe.thermalcorrenthalpy: 0.471912 hartree
zpe.thermalcorrgfe: 0.395165 hartree
zpe.sumelectzpe: -1116.016983 hartree
zpe.sumelectthermal: -1115.993000 hartree
zpe.sumelectthermalent: -1115.992055 hartree
zpe.sumelectthermalfe: -1116.068803 hartree
dipole: -2.3699 1.3233 -2.5519
dipole: 3.7255
quadrupole: -194.5569 -150.8140 -148.4497
quadrupole: 10.9208 23.2603 1.3674
quadrupole: -29.9500 13.7929 16.1572 10.9208 23.2603 1.3674
hfenergy: -1116.4639675 hartree
pointgroup: C01 [X(C21H28O4)]
dipole: -0.9243345 0.5289073 -1.0070894 debye
polarizability: 300.4917844|-7.3116993|213.1834738|-9.6984958|-0.0528981|176.1951038 unknown
InChI: InChI=1S/C21H28O4/c1-11(22)14-4-5-15-13-9-17(24)16-8-12(23)6-7-20(16,2)19(13)18(25)10-21(14,15)3/h8,13-15,17,19,24H,4-7,9-10H2,1-3H3
charge 0 multiplicity 1
53 atoms
O  0.043121 -2.577956 0.79008
O  2.04465 2.566294 1.455585
O  -5.710228 -0.092862 0.722262
O  6.167447 -0.478015 -0.951393
C  -1.528509 0.989119 -0.520646
C  -2.421056 -0.186903 -0.009968
C  -0.107217 0.989115 0.077157
C  0.600092 -0.382507 -0.22546
C  -3.77569 0.17469 -0.7468
C  2.065711 -0.486937 0.347173
C  -2.415408 2.243233 -0.32971
C  -1.747669 -1.514028 -0.450436
C  0.737702 2.137698 -0.512459
C  -3.868223 1.729679 -0.608915
C  -0.319609 -1.581053 0.109967
C  2.845363 0.775449 -0.068181
C  2.168336 2.138764 0.034135
C  -2.610107 -0.186226 1.528667
C  2.761581 -1.741774 -0.27443
C  2.06289 -0.583196 1.909489
C  -5.00511 -0.566171 -0.210395
C  4.288014 -1.776648 -0.054481
C  4.14954 0.732203 -0.490928
C  4.965197 -0.502521 -0.546633
C  -5.346542 -1.903106 -0.857265
H  -1.415508 0.833347 -1.62001
H  -0.16231 1.139498 1.171616
H  0.688865 -0.414662 -1.339243
H  -3.64219 -0.110341 -1.811115
H  -2.129285 3.063095 -1.011375
H  -2.322057 2.631671 0.701559
H  -1.701511 -1.553603 -1.559401
H  -2.284513 -2.40853 -0.088519
H  0.279528 3.113927 -0.270879
H  0.774938 2.046128 -1.617362
H  -4.555574 1.979962 0.217315
H  -4.288242 2.172313 -1.529387
H  2.78139 2.885461 -0.512601
H  -3.120605 0.725213 1.880922
H  -3.226879 -1.046248 1.844925
H  -1.644083 -0.269505 2.057481
H  2.565086 -1.749266 -1.366836
H  2.300554 -2.649473 0.147373
H  1.542435 0.277571 2.360551
H  1.571926 -1.517727 2.223931
H  3.097752 -0.582452 2.296632
H  4.749708 -2.641757 -0.562587
H  4.522311 -1.888571 1.02412
H  4.66914 1.653001 -0.792233
H  2.948409 2.570625 1.863427
H  -5.76697 -1.723217 -1.866773
H  -4.445733 -2.528223 -0.994395
H  -6.094353 -2.442576 -0.255453
