program: Gaussian 09
title: 000222788
version: EM64L-G09RevD.01
frameworkgroup: C1[X(C8H14INO3)]
method: RPBEPBE
basis: SDD
operation: Freq
keyword: #p
keyword: freq=noraman
keyword: PBEPBE/SDD
title: #p freq=noraman PBEPBE/SDD
converged: YES YES NO NO
title: Mulliken charges:
elementType: I O O O N C C C C C C C C H H H H H H H H H H H H H H
charge: 0.023812 -0.431452 -0.211533 -0.269146 -0.357313 -0.010796 -0.430199 -0.128795 -0.726570 -0.708032 0.153878 0.307180 -0.837259 0.195032 0.214975 0.231424 0.291279 0.215155 0.244511 0.214947 0.241505 0.208543 0.212668 0.332049 0.315532 0.316786 0.391817
chargesum: 0.00000
title: Mulliken charges with hydrogens summed into heavy atoms:
elementType: I O O O N C C C C C C C C
charge: 0.023812 -0.039636 -0.211533 -0.269146 -0.025265 0.184236 0.016201 0.162485 -0.051956 -0.045316 0.153878 0.307180 -0.204941
polarizability: 1.53746576e+02 -6.03226256e+00 1.16543647e+02 1.71962687e+01 -1.34612412e+01 1.04947153e+02
1716.lowfreq: -17.0223 -9.0092 -0.0008 -0.0008 -0.0008 7.1142 17.3572 19.7590 32.6368
frequency: 9.3412 19.4143 32.6185 62.4255 68.9122 80.2571 104.0203 130.7330 192.5366 208.1027 244.2257 261.6701 287.4645 301.8229 330.5522 370.1718 384.1328 446.0123 518.3028 547.6875 580.5725 593.5167 611.4485 618.8183 660.8675 682.5427 790.4730 834.0088 837.9655 864.9046 922.3936 932.9250 954.0261 970.6869 999.1830 1066.1948 1082.4917 1122.2593 1140.2079 1144.2859 1201.9475 1203.7076 1230.7819 1257.4314 1264.2954 1298.2437 1309.3088 1319.7929 1343.2466 1355.0255 1385.1368 1404.4567 1410.2949 1448.8776 1463.0907 1483.1788 1487.0829 1501.6856 1511.9893 1590.8189 1670.1643 2952.3680 2972.7460 2977.3133 2982.5776 3034.8348 3056.0972 3066.4799 3067.9183 3069.6964 3072.5812 3090.8079 3148.7376 3493.1947 3526.7256
redmass: 2.8706 5.4566 9.0962 6.9776 6.6213 2.9394 2.7517 5.5391 4.2141 4.1554 1.2091 1.0481 5.1546 10.9729 2.6195 2.1722 2.2045 6.0856 2.8995 2.7237 1.9187 2.2685 3.5811 4.1091 1.2685 3.2533 3.3318 2.4282 1.7441 3.0874 1.2151 4.0748 1.5604 2.0522 2.2704 1.9286 2.9918 1.7731 1.2371 2.2248 1.6973 1.3453 1.3291 1.4581 1.6977 1.7352 1.4376 1.5384 1.4384 1.3067 1.2165 1.2024 1.1060 1.0927 1.0441 1.0489 1.0531 1.0565 1.8932 8.9254 9.3060 1.0797 1.0367 1.0501 1.0484 1.0997 1.0863 1.0995 1.0567 1.1002 1.0988 1.0985 1.1076 1.0779 1.0644
irintensity: 0.0399 0.6146 2.1276 4.0255 5.2707 6.8902 1.8247 1.9865 2.8150 1.6262 0.3451 0.1621 1.8818 5.4821 0.6446 0.9739 2.2985 21.3823 2.4792 4.2811 75.7431 63.3863 4.6083 111.5928 125.1289 49.0734 7.2754 15.2739 20.0023 36.0611 1.8131 16.2018 4.0553 8.0901 2.3410 99.0909 68.2962 20.1044 2.0364 28.2132 4.4652 46.0115 6.0038 17.9055 21.0710 46.9399 1.4963 7.4632 2.0458 3.2488 22.4200 30.8639 28.5954 22.9558 2.0695 23.5258 4.4398 20.8272 282.8439 155.3664 238.3806 19.4247 35.6382 40.0467 22.0493 13.6080 10.7802 27.9135 0.9979 25.1012 55.9950 35.0581 0.1420 67.6020 35.4171
temp: 298.150 k
press: 1.00000 atm
elementType: 53 8 8 8 7 6 6 6 6 6 6 6 6 1 1 1 1 1 1 1 1 1 1 1 1 1 1
symmnumber: 1
zpe: 566209.4 jmol-1
zpe.correction: 0.215658 hartree
zpe.thermalcorrener: 0.231317 hartree
zpe.thermalcorrenthalpy: 0.232261 hartree
zpe.thermalcorrgfe: 0.167597 hartree
zpe.sumelectzpe: -604.167779 hartree
zpe.sumelectthermal: -604.152119 hartree
zpe.sumelectthermalent: -604.151175 hartree
zpe.sumelectthermalfe: -604.215839 hartree
dipole: -0.7147 0.8050 -2.4914
dipole: 2.7140
quadrupole: -100.7186 -89.3589 -96.7895
quadrupole: -4.6774 -8.2098 -0.7535
quadrupole: -5.0963 6.2634 -1.1672 -4.6774 -8.2098 -0.7535
hfenergy: -604.3834365 hartree
pointgroup: C01 [X(C8H14I1N1O3)]
dipole: 0.3234767 0.0803651 1.0144008 debye
polarizability: 126.0957588|4.0234019|109.3786778|-15.3867692|-26.0533138|139.762939 unknown
InChI: InChI=1S/C8H14INO3/c1-5(2)3-6(8(12)13)10-7(11)4-9/h5-6,10,12H,3-4H2,1-2H3
charge 0 multiplicity 1
27 atoms
I  -2.686271 -1.62405 2.827293
O  1.734706 -2.012208 1.35452
O  2.978091 -1.423965 -0.52009
O  -1.685991 -0.222236 -1.247926
N  -0.358678 -0.561237 0.641348
C  0.819863 2.479412 -0.039725
C  1.499225 1.180665 0.485258
C  0.902517 -0.180165 -0.009491
C  0.790339 2.541043 -1.586396
C  -0.586692 2.743927 0.550187
C  1.97114 -1.255726 0.195617
C  -1.547111 -0.585461 -0.034032
C  -2.814459 -1.066764 0.673425
H  1.482368 3.297863 0.316304
H  1.497904 1.179477 1.593789
H  2.558279 1.19861 0.15995
H  0.70582 -0.115973 -1.094193
H  1.784441 2.325723 -2.021868
H  0.061904 1.819826 -2.001322
H  0.483282 3.547371 -1.925505
H  -1.337835 2.061266 0.117708
H  -0.596923 2.627637 1.65018
H  -0.908348 3.775772 0.315642
H  -0.314924 -0.919118 1.600813
H  -3.192776 -1.968051 0.167802
H  -3.576054 -0.274118 0.629852
H  2.465582 -2.675421 1.47976
