program: Gaussian 09
title: 000222776
version: EM64L-G09RevD.01
frameworkgroup: C1[X(C19H32ClNO)]
method: RPBEPBE
basis: SDD
operation: Freq
keyword: #p
keyword: freq=noraman
keyword: PBEPBE/SDD
title: #p freq=noraman PBEPBE/SDD
converged: YES YES NO NO
title: Mulliken charges:
elementType: Cl O N C C C C C C C C C C C C C C C C C C C H H H H H H H H H H H H H H H H H H H H H H H H H H H H H H H H
charge: -0.060374 -0.454122 -0.127755 -0.064056 -0.362318 -0.392865 -0.235958 -0.379007 -0.369508 -0.741657 -0.339470 -0.339106 0.398973 -0.356478 -0.357470 -0.412699 -0.363606 -0.696233 -0.695841 -0.210805 -0.218208 -0.115846 0.229876 0.184124 0.222572 0.204456 0.191268 0.211248 0.204021 0.187314 0.204929 0.188444 0.249668 0.216623 0.224384 0.181785 0.190977 0.184656 0.183924 0.195278 0.193172 0.196869 0.196335 0.343229 0.251028 0.274802 0.209289 0.212596 0.214872 0.210254 0.209732 0.215871 0.256636 0.254176
chargesum: 0.00000
title: Mulliken charges with hydrogens summed into heavy atoms:
elementType: Cl O N C C C C C C C C C C C C C C C C C C C
charge: -0.060374 -0.110893 -0.127755 0.165821 0.044379 0.002859 -0.024709 0.012328 0.023865 -0.050981 0.033291 0.029473 0.398973 0.031971 0.035734 -0.161671 -0.088804 -0.059477 -0.059984 0.045831 0.035968 -0.115846
polarizability: 2.86783584e+02 1.45016675e+01 2.10863122e+02 -1.60082628e+00 -1.88232815e+01 1.80413599e+02
1716.lowfreq: -6.6447 0.0014 0.0017 0.0018 5.5576 7.9457 17.0862 18.6321 24.3364
frequency: 16.9083 18.5164 24.0177 30.2283 40.6470 44.9499 50.4452 64.7897 83.4441 96.8502 110.8322 122.3840 130.4089 134.8128 145.4227 165.4534 178.1704 210.6697 226.0620 232.3835 236.0301 248.5783 254.7638 265.0719 274.6186 307.3714 319.9380 330.8300 336.0222 352.7855 397.8040 412.4111 416.3053 429.3067 460.6540 499.7959 527.4475 563.0597 611.3036 622.6259 683.8486 724.6312 725.2343 728.2683 751.2679 757.0695 767.9137 799.1920 829.6715 838.9356 840.7297 843.5288 871.7240 891.6282 899.6864 946.5408 954.8315 960.9418 964.5359 971.1014 983.3591 1001.1530 1008.2975 1018.2399 1035.6433 1050.1182 1061.1193 1070.5648 1073.7247 1075.1581 1081.8905 1097.2154 1107.6882 1116.2906 1116.7136 1138.1717 1171.5520 1180.9284 1187.5748 1189.9945 1213.5398 1222.0199 1238.6345 1246.0123 1250.3985 1268.7132 1275.8570 1279.4556 1281.3704 1285.3904 1295.7897 1299.5234 1303.4660 1313.5552 1315.5588 1323.6367 1351.6568 1352.5926 1356.0108 1365.5314 1369.0678 1372.2596 1384.0184 1385.8908 1390.2168 1391.0628 1405.1767 1462.0705 1462.9364 1464.9030 1465.4474 1469.5801 1472.7138 1473.7807 1475.0791 1476.4092 1478.0492 1480.9459 1483.5231 1487.5799 1489.0703 1491.8670 1584.6173 1596.4718 2857.6070 2866.7657 2951.7775 2952.3376 2965.0444 2965.5795 2971.1956 2972.0359 2972.1374 2974.5226 2975.0815 2987.8661 2991.4699 2991.6847 3004.1126 3014.8077 3016.5385 3026.1365 3033.8151 3045.2645 3053.9206 3068.2817 3068.6179 3070.7449 3070.8851 3079.4195 3096.7443 3135.1914 3149.6467 3167.4957 3171.5489 3558.9668
redmass: 5.8051 5.0342 3.7323 1.9105 2.4627 1.8281 3.7498 3.6300 3.3019 3.1141 2.8247 2.8307 1.9045 3.1247 2.5221 6.5410 3.4377 3.2657 1.1475 1.1246 2.6154 2.0803 2.9616 1.4842 3.2689 3.8116 2.0665 3.7144 1.5051 4.5713 3.4467 2.9243 3.5484 3.4168 3.7841 3.7109 3.3576 3.1803 3.5343 6.9655 4.6300 1.0718 1.0680 3.4049 1.2456 1.1332 2.7293 3.1787 1.4154 1.4454 1.2460 1.2446 2.2168 1.8695 1.8563 1.6472 1.4327 1.2265 2.0238 1.3511 2.4156 4.1890 3.4445 3.2605 2.3722 2.6740 2.2304 2.6391 2.3381 2.4265 2.2135 2.0384 1.3623 2.2161 2.3419 1.8697 2.0262 1.1310 1.9791 1.9839 1.4805 1.5374 1.5928 1.3036 1.3549 1.2411 1.2583 1.2802 1.0636 1.0717 1.1226 1.1693 1.3293 1.4350 1.3749 1.4134 1.6051 1.6617 1.7142 1.3744 1.3476 1.3770 1.7935 2.1605 1.2178 1.2176 1.8887 1.0735 1.0719 1.0740 1.0762 1.0672 1.3321 1.0750 1.5564 1.0611 1.0423 1.0809 1.0754 1.0840 1.0879 1.0600 7.2812 6.1818 1.0710 1.0710 1.0587 1.0588 1.0592 1.0595 1.0489 1.0423 1.0432 1.0686 1.0746 1.0361 1.0974 1.0973 1.0837 1.0961 1.1001 1.0958 1.0967 1.1007 1.0948 1.1007 1.1006 1.0992 1.0993 1.0982 1.0996 1.0893 1.0882 1.0956 1.0970 1.0662
irintensity: 0.0761 0.0540 0.0422 0.0335 0.0810 0.0263 0.1538 0.3891 0.0854 0.0113 0.4508 0.2850 0.0547 0.2867 0.1200 2.5829 0.4596 0.4605 0.0344 0.0216 5.9427 5.9790 0.2454 1.0198 2.0258 6.9953 53.3508 2.3077 91.6328 3.5747 5.3935 0.3028 5.5806 4.5017 6.9157 22.6174 18.1903 8.9210 14.6417 0.1421 5.9244 13.6332 9.5501 10.6353 3.1910 0.5986 22.4132 19.4907 27.3624 37.5563 1.6353 6.7848 2.5329 6.3941 6.9428 18.0955 8.6301 5.0324 53.7350 0.6968 12.1278 29.5823 1.5439 2.3277 10.3263 9.6109 4.5887 46.0202 5.7006 3.3911 48.9436 54.3538 8.1378 7.0081 3.9765 12.9465 1.8144 0.2167 17.0216 7.1044 3.6316 20.4783 7.7131 3.7794 6.0125 4.5226 8.7138 2.2468 0.5580 2.7562 1.5965 13.9756 3.6196 10.2325 0.8593 5.1618 1.6576 3.4647 17.6799 16.8141 14.0613 1.8271 12.5054 14.9258 13.2795 11.7033 15.2070 2.0998 1.1075 1.1347 0.0129 16.0338 21.4948 0.4205 31.4224 20.1311 12.1527 0.3548 0.6671 24.0413 12.4055 11.1418 2.9366 12.9817 41.3148 119.7272 11.4634 10.4143 27.5293 7.7027 105.4861 56.8945 4.2942 5.3862 95.4843 22.6844 2.7609 1.4810 24.8010 8.4856 3.0900 6.8502 34.5361 69.8890 71.6545 90.1275 90.1633 52.0567 59.3150 46.9097 26.5383 7.2647 1.5493 6.6490 0.9561 5.0911
temp: 298.150 k
press: 1.00000 atm
elementType: 17 8 7 6 6 6 6 6 6 6 6 6 6 6 6 6 6 6 6 6 6 6 1 1 1 1 1 1 1 1 1 1 1 1 1 1 1 1 1 1 1 1 1 1 1 1 1 1 1 1 1 1 1 1
symmnumber: 1
zpe: 1235679.6 jmol-1
zpe.correction: 0.470645 hartree
zpe.thermalcorrener: 0.497118 hartree
zpe.thermalcorrenthalpy: 0.498063 hartree
zpe.thermalcorrgfe: 0.410140 hartree
zpe.sumelectzpe: -1331.483037 hartree
zpe.sumelectthermal: -1331.456565 hartree
zpe.sumelectthermalent: -1331.455620 hartree
zpe.sumelectthermalfe: -1331.543543 hartree
dipole: -1.6644 0.1001 -0.2139
dipole: 1.6811
quadrupole: -155.3730 -142.9265 -141.3104
quadrupole: -4.0550 2.1669 0.7197
quadrupole: -8.8364 3.6101 5.2263 -4.0550 2.1669 0.7197
hfenergy: -1331.9536829 hartree
pointgroup: C01 [X(C19H32Cl1N1O1)]
dipole: -0.4032306 0.5222505 0.0457851 debye
polarizability: 222.8186603|-29.2645355|275.7277752|-11.3221654|-16.1725238|179.5138689 unknown
InChI: InChI=1S/C19H32ClNO/c1-4-6-8-14-21(15-9-7-5-2)16(3)19(22)17-10-12-18(20)13-11-17/h10-13,16,19,22H,4-9,14-15H2,1-3H3
charge 0 multiplicity 1
54 atoms
Cl 3.214456 -4.900493 1.222379
O  2.688372 1.820637 0.033151
N  -0.815234 0.687377 -0.601725
C  0.537695 1.244414 -0.889096
C  -1.088578 -0.692425 -1.078958
C  -1.911188 1.652448 -0.879575
C  1.513998 0.958739 0.299012
C  -2.101696 -1.446506 -0.190261
C  -2.096252 2.69477 0.244709
C  1.127408 0.888081 -2.274791
C  -2.408264 -2.866112 -0.718491
C  -3.204511 3.726626 -0.064928
C  1.935964 -0.490126 0.512203
C  -3.413021 -3.639321 0.165853
C  -3.388233 4.770856 1.059838
C  1.283081 -1.284586 1.48823
C  2.999487 -1.062775 -0.233734
C  -3.723418 -5.053611 -0.370137
C  -4.498248 5.79928 0.752972
C  1.659396 -2.628359 1.707959
C  3.392605 -2.40353 -0.026015
C  2.710683 -3.166934 0.941751
H  0.43212 2.346782 -0.862851
H  -1.456647 -0.7029 -2.135873
H  -0.140858 -1.25916 -1.071697
H  -2.853978 1.084667 -0.990414
H  -1.751989 2.184402 -1.85122
H  0.981457 1.307885 1.208089
H  -1.691806 -1.505739 0.836962
H  -3.047859 -0.872601 -0.117192
H  -2.327694 2.156265 1.184848
H  -1.139442 3.229383 0.4173
H  2.091576 1.407309 -2.411365
H  0.438006 1.215517 -3.075019
H  1.29781 -0.195648 -2.395389
H  -2.809412 -2.798841 -1.752008
H  -1.463856 -3.445859 -0.788889
H  -2.968995 4.251751 -1.01479
H  -4.167382 3.199236 -0.232716
H  -3.008705 -3.713175 1.196177
H  -4.35383 -3.056391 0.242994
H  -3.620018 4.24568 2.008852
H  -2.427109 5.299383 1.224477
H  3.34238 1.697993 0.767316
H  0.469065 -0.849472 2.079323
H  3.524038 -0.44914 -0.972917
H  -4.157837 -5.005106 -1.386686
H  -2.803545 -5.66564 -0.428872
H  -4.442447 -5.585709 0.27973
H  -4.273875 6.359866 -0.174314
H  -5.474945 5.298438 0.612594
H  -4.60985 6.533012 1.572464
H  1.15335 -3.238425 2.461703
H  4.212577 -2.843911 -0.601061
