program: Gaussian 09
title: 000222771
version: EM64L-G09RevD.01
frameworkgroup: C1[X(C16H26N2O)]
method: RPBEPBE
basis: SDD
operation: Freq
keyword: #p
keyword: freq=noraman
keyword: PBEPBE/SDD
title: #p freq=noraman PBEPBE/SDD
converged: YES YES NO NO
title: Mulliken charges:
elementType: O N N C C C C C C C C C C C C C C C C H H H H H H H H H H H H H H H H H H H H H H H H H H
charge: -0.295249 -0.112923 -0.362177 -0.353668 -0.365791 -0.352910 -0.348222 -0.377126 -0.334169 -0.350513 -0.690660 -0.693200 0.168844 0.283966 -0.355670 -0.354838 -0.223257 -0.240624 -0.228702 0.196574 0.188785 0.191168 0.202847 0.193042 0.192307 0.234870 0.188869 0.221617 0.255920 0.205294 0.186397 0.187081 0.192423 0.299267 0.207957 0.214454 0.209591 0.219998 0.213059 0.208462 0.275557 0.211755 0.230885 0.227705 0.231005
chargesum: 0.00000
title: Mulliken charges with hydrogens summed into heavy atoms:
elementType: O N N C C C C C C C C C C C C C C C C
charge: -0.295249 -0.112923 -0.062910 0.031691 0.028224 0.032438 0.075517 0.100411 0.057522 0.028990 -0.058657 -0.051680 0.168844 0.283966 -0.080113 -0.143083 0.007628 -0.012920 0.002304
polarizability: 2.38977663e+02 1.69986796e+00 1.66435928e+02 1.24201629e+01 -2.38502829e+01 1.67628925e+02
1716.lowfreq: -7.4612 -4.5464 -0.0009 -0.0005 -0.0002 7.1734 13.1696 20.4920 26.5545
frequency: 12.6356 20.2153 26.3981 31.3867 42.1019 59.2899 77.0087 85.7162 99.1876 112.5059 126.6905 139.7404 190.1017 203.4289 226.4434 233.1233 244.5890 260.4936 274.1414 291.6978 325.2348 366.0398 376.3664 401.8234 438.5166 440.7878 474.7549 504.1429 534.0514 587.2613 614.8887 655.5967 684.0761 701.4560 737.5208 742.9526 774.1582 792.0120 795.2045 818.3376 844.3126 853.8936 877.8759 901.7990 932.4306 938.8062 943.7740 955.7634 983.4997 989.3312 1004.9389 1010.7602 1020.6688 1029.6863 1045.1341 1062.2530 1072.6302 1082.7260 1092.9797 1102.3532 1113.9249 1127.3387 1132.4234 1172.5438 1183.0567 1190.5108 1191.7147 1225.1546 1232.9544 1251.2286 1259.5772 1278.1205 1283.1753 1284.7916 1299.5243 1307.7978 1314.8938 1320.6434 1340.0321 1351.8472 1358.5149 1371.2428 1384.6519 1386.8376 1390.1003 1391.7583 1431.9462 1460.6805 1461.8666 1464.5458 1469.8002 1472.9114 1475.8476 1477.6477 1478.3260 1482.6275 1483.9715 1488.0984 1492.8389 1496.9925 1566.0560 1602.8429 1610.9856 2854.2799 2879.4688 2960.8350 2963.1932 2966.8630 2969.9628 2971.6631 2974.0433 2980.0494 3002.4671 3004.1045 3012.0532 3015.9085 3023.7543 3034.7358 3049.8018 3068.0957 3069.6626 3070.5140 3074.7676 3114.9949 3129.8831 3143.1369 3156.7029 3168.2620 3551.4603
redmass: 4.5327 3.8179 4.2098 3.2321 4.9966 2.5904 2.7416 1.8996 2.2822 2.7259 2.1907 3.3052 3.9356 2.2912 2.5066 1.6007 1.1630 2.9176 2.4051 3.6919 2.6099 3.0042 4.4922 2.8696 2.3762 3.3606 3.1676 2.2661 2.9474 1.6003 6.2085 5.7708 4.7517 1.5201 1.2909 1.0881 2.5462 2.3195 1.1880 1.8847 2.8874 1.2628 1.7428 1.7435 1.4517 1.2397 1.3997 2.4209 1.3944 5.8070 1.3468 3.2241 3.1212 2.1848 2.9346 2.1425 2.2967 1.6117 2.1048 2.2017 2.1739 2.2503 2.3384 1.0596 1.6695 2.1228 1.2742 1.2666 1.3790 1.2426 2.0389 1.2748 1.1130 1.3910 1.1729 1.2989 1.3346 1.3586 1.3528 1.5220 1.5078 1.3406 8.3577 1.2843 1.2170 1.2829 2.2122 1.1208 1.5092 1.1784 1.0680 1.0742 1.0645 1.0446 1.0431 1.0666 1.3351 1.0823 1.0925 1.7411 6.8653 6.6777 6.1065 1.0706 1.0695 1.0587 1.0595 1.0578 1.0583 1.0392 1.0365 1.0597 1.0949 1.0978 1.0924 1.0927 1.1029 1.1011 1.1028 1.1006 1.0994 1.1001 1.1002 1.0872 1.0869 1.0920 1.0957 1.1005 1.0773
irintensity: 1.6183 1.3172 0.0155 0.0174 6.0480 3.0639 0.1369 0.0245 0.7685 0.7437 0.6960 0.8608 1.3981 4.1004 2.5030 1.5576 0.7951 4.6849 0.6774 5.8398 0.9638 3.1904 2.2626 0.0519 1.5255 8.9494 0.7632 22.5957 3.1334 86.1859 0.9991 7.3869 11.0597 95.7597 3.6750 9.4086 9.9811 19.0817 1.7711 0.6224 8.7431 0.9967 2.7254 13.3754 2.1735 10.0184 17.6000 7.8075 1.3428 1.2049 3.0791 2.2777 0.7660 13.6657 47.1771 2.8366 17.5152 47.8988 58.1587 26.3571 1.6962 2.0377 35.6241 1.1253 35.5060 25.0344 4.6282 3.5068 13.9352 16.0761 75.3785 41.3342 3.0086 12.7826 0.8080 14.7614 5.8980 35.9321 8.8691 10.8137 16.3813 2.9688 2.1892 7.5778 11.2095 6.6379 3.2415 28.4072 146.8978 31.9387 1.4917 4.7246 5.2556 12.2093 11.9081 6.6363 27.9456 5.5892 31.1176 138.8284 107.6881 43.8120 3.0996 80.2672 133.6686 31.0340 6.9151 44.4353 56.6319 62.5588 25.9566 55.2709 3.6097 13.0950 1.1609 35.8703 16.9072 76.1071 31.6210 91.3598 55.0869 61.6657 63.2271 12.6519 1.9727 24.6240 16.5800 22.1901 15.9812
temp: 298.150 k
press: 1.00000 atm
elementType: 8 7 7 6 6 6 6 6 6 6 6 6 6 6 6 6 6 6 6 1 1 1 1 1 1 1 1 1 1 1 1 1 1 1 1 1 1 1 1 1 1 1 1 1 1
symmnumber: 1
zpe: 1029031.9 jmol-1
zpe.correction: 0.391938 hartree
zpe.thermalcorrener: 0.413377 hartree
zpe.thermalcorrenthalpy: 0.414322 hartree
zpe.thermalcorrgfe: 0.337423 hartree
zpe.sumelectzpe: -808.546488 hartree
zpe.sumelectthermal: -808.525048 hartree
zpe.sumelectthermalent: -808.524104 hartree
zpe.sumelectthermalfe: -808.601003 hartree
dipole: -1.9969 -2.2821 1.8305
dipole: 3.5421
quadrupole: -106.3724 -118.0523 -119.3364
quadrupole: -5.1767 8.5222 1.0193
quadrupole: 8.2146 -3.4652 -4.7494 -5.1767 8.5222 1.0193
hfenergy: -808.9384257 hartree
pointgroup: C01 [X(C16H26N2O1)]
dipole: 0.1850754 -1.2557112 -0.5753026 debye
polarizability: 207.4980699|-32.7735173|194.3292667|31.6304046|6.3066476|171.2151796 unknown
InChI: InChI=1S/C16H26N2O/c1-3-5-12-18(13-6-4-2)14-17-16(19)15-10-8-7-9-11-15/h7-11,17H,3-6,12-14H2,1-2H3
charge 0 multiplicity 1
45 atoms
O  -0.660531 2.200097 1.799462
N  1.960085 -0.878689 1.267227
N  -0.31852 -0.02376 1.213242
C  2.540069 -2.109819 1.859371
C  2.963914 0.021082 0.645097
C  2.84829 -3.205716 0.809783
C  2.370355 1.040003 -0.349715
C  0.904276 -0.204115 2.028442
C  1.5885 -3.748197 0.101262
C  3.465948 1.904259 -1.015146
C  1.911341 -4.801743 -0.979856
C  2.882183 2.946986 -1.992849
C  -0.982472 1.183345 1.098703
C  -2.120522 1.238162 0.106534
C  -3.068357 2.282077 0.259103
C  -2.262956 0.328213 -0.97395
C  -4.151563 2.401945 -0.635899
C  -3.344339 0.451621 -1.873964
C  -4.295243 1.484399 -1.70378
H  3.472279 -1.881642 2.431629
H  1.812673 -2.519226 2.587432
H  3.54038 0.574571 1.430092
H  3.693024 -0.613148 0.105555
H  3.553015 -2.809986 0.050427
H  3.377814 -4.036902 1.320496
H  1.654648 1.707624 0.167477
H  1.797275 0.493899 -1.12547
H  0.655849 -0.808841 2.922106
H  1.18368 0.810851 2.376569
H  1.049831 -2.892762 -0.352029
H  0.906768 -4.188712 0.858437
H  4.180566 1.24754 -1.553231
H  4.050748 2.424215 -0.2286
H  -0.591942 -0.826084 0.643859
H  2.439228 -5.671871 -0.545438
H  0.992685 -5.175294 -1.468841
H  2.562431 -4.374856 -1.766231
H  2.188699 3.631359 -1.469731
H  3.678435 3.558489 -2.455779
H  2.315901 2.455114 -2.806121
H  -2.924822 2.988578 1.083182
H  -1.519646 -0.459557 -1.149144
H  -4.881101 3.208759 -0.504991
H  -3.440101 -0.249272 -2.710644
H  -5.134774 1.578203 -2.401679
