program: Gaussian 09
title: 000222766
version: EM64L-G09RevD.01
frameworkgroup: C1[X(C10H13N3O2S2)]
method: RPBEPBE
basis: SDD
operation: Freq
keyword: #p
keyword: freq=noraman
keyword: PBEPBE/SDD
title: #p freq=noraman PBEPBE/SDD
converged: YES YES NO NO
title: Mulliken charges:
elementType: S S O O N N N C C C C C C C C C C H H H H H H H H H H H H H
charge: 0.987331 0.160524 -0.486020 -0.540906 -0.584787 -0.029383 -0.687310 -0.129621 -0.698196 -0.047510 -0.674720 -0.104474 -0.222155 -0.148658 -0.390467 -0.413081 0.517884 0.240876 0.261700 0.288646 0.209951 0.231729 0.234877 0.351805 0.284045 0.293233 0.231946 0.231552 0.315651 0.315537
chargesum: 0.00000
title: Mulliken charges with hydrogens summed into heavy atoms:
elementType: S S O O N N N C C C C C C C C C C
charge: 0.987331 0.160524 -0.486020 -0.540906 -0.232982 -0.029383 -0.056122 0.111255 -0.147850 -0.047510 0.001837 -0.104474 0.061889 0.144575 -0.158521 -0.181529 0.517884
polarizability: 2.24636041e+02 -1.69825459e+01 1.89955199e+02 -9.71087749e+00 -1.77008395e+01 1.41044112e+02
1716.lowfreq: 0.0015 0.0020 0.0022 4.5334 7.9291 14.8737 22.4673 36.0394 50.7914
frequency: 22.1482 35.8950 50.6904 73.5653 86.2117 105.4892 131.7880 139.5856 182.6819 202.5254 221.0310 236.2267 241.7335 293.8551 321.0292 339.6893 392.3830 404.6690 411.3082 413.8970 417.5421 424.0967 436.8067 442.1849 499.1709 516.2728 568.9086 578.4709 597.1752 622.7612 630.8250 700.0873 719.6564 742.1342 802.3356 807.2114 810.5943 820.1279 832.6581 876.8085 903.6188 940.2316 959.1991 965.4000 980.6955 1013.3883 1021.6772 1047.9830 1052.8101 1089.0407 1132.9210 1151.2145 1185.5820 1198.3371 1230.8682 1278.9101 1304.2055 1314.1663 1316.4938 1323.9202 1381.8827 1402.6245 1437.3758 1442.7297 1464.6189 1475.1033 1490.6971 1585.7023 1613.6198 1646.6549 1648.5659 2984.1587 3013.9016 3043.0198 3083.8892 3094.3607 3123.4507 3134.5436 3137.0494 3164.6155 3177.5867 3522.8804 3562.3470 3701.2001
redmass: 4.9000 4.8800 4.1132 6.0959 6.0912 3.4948 5.6377 6.3235 6.3097 8.8536 7.5574 6.7189 1.1280 6.5532 4.8467 2.5080 3.6013 3.3341 1.4968 1.5634 5.2533 2.5231 1.7512 1.8380 4.4500 2.7514 10.3539 5.5500 6.2221 6.8388 5.6647 5.9755 2.9096 3.2682 4.2860 1.4485 3.2862 6.5377 1.8155 1.7605 2.5734 1.4040 5.1801 1.5636 5.1529 1.7002 1.4539 1.4068 2.4797 1.6472 1.1954 2.0498 1.1142 2.1922 1.2718 1.2936 1.2898 1.3887 1.5809 2.5636 1.2098 5.7731 3.7592 1.0858 1.0480 1.0496 2.9185 7.4420 4.7907 1.6679 3.1716 1.0352 1.0837 1.0590 1.1000 1.1000 1.1096 1.0900 1.0894 1.0959 1.0954 1.0789 1.0452 1.1039
irintensity: 1.1417 0.7691 0.6076 0.2899 0.4218 0.7921 2.0818 2.9699 1.2989 3.6790 6.3653 5.7395 0.4824 29.9724 9.1659 1.2170 27.4524 4.2676 1.3180 2.5685 80.2126 51.8442 171.1718 233.9941 11.6415 17.7643 14.0171 18.5052 6.4494 7.4894 193.1613 20.2099 0.8247 5.5302 51.5971 1.6521 15.6895 94.2786 78.4968 38.6951 71.3316 0.8471 64.1057 10.3350 9.1486 39.3294 2.5459 11.6961 55.7214 83.7462 13.5032 3.3162 45.0034 23.7211 21.2516 20.2341 5.4966 6.3311 122.5077 65.9228 17.9833 4.9913 2.8957 7.7165 11.0688 6.2136 65.4873 7.2366 173.9677 211.4007 342.8960 24.5609 13.3325 34.6471 44.2789 19.0366 10.5026 13.6374 12.3674 6.2242 6.6463 72.1035 112.6070 25.5564
temp: 298.150 k
press: 1.00000 atm
elementType: 16 16 8 8 7 7 7 6 6 6 6 6 6 6 6 6 6 1 1 1 1 1 1 1 1 1 1 1 1 1
symmnumber: 1
zpe: 585545.0 jmol-1
zpe.correction: 0.223022 hartree
zpe.thermalcorrener: 0.240839 hartree
zpe.thermalcorrenthalpy: 0.241783 hartree
zpe.thermalcorrgfe: 0.176142 hartree
zpe.sumelectzpe: -1498.245569 hartree
zpe.sumelectthermal: -1498.227752 hartree
zpe.sumelectthermalent: -1498.226808 hartree
zpe.sumelectthermalfe: -1498.292450 hartree
dipole: 3.0948 -7.5916 -1.7598
dipole: 8.3850
quadrupole: -85.4636 -116.3326 -118.6646
quadrupole: -12.3535 -8.1793 -8.6857
quadrupole: 21.3567 -9.5123 -11.8444 -12.3535 -8.1793 -8.6857
hfenergy: -1498.4685914 hartree
pointgroup: C01 [X(C10H13N3O2S2)]
dipole: -1.0991782 3.1019931 -0.2283741 debye
polarizability: 223.7010212|-16.7518172|187.604487|-1.4073675|24.4532537|144.3298449 unknown
InChI: InChI=1S/C10H13N3O2S2/c1-7-6-16-10(12-7)13-17(14,15)9-4-2-8(11)3-5-9/h2-5,7,13H,6,11H2,1H3
charge 0 multiplicity 1
30 atoms
S  -0.15551 -2.135243 0.109559
S  3.602774 -0.198062 -1.730577
O  0.354106 -2.473862 1.606894
O  -0.747228 -3.302137 -0.857582
N  1.277691 -1.538936 -0.957278
N  2.000466 0.253929 0.453675
N  -4.100772 2.434272 0.29085
C  2.990863 1.362247 0.480223
C  4.245246 0.951197 -0.365678
C  2.129945 -0.525607 -0.576489
C  2.334645 2.663115 -0.035269
C  -1.330511 -0.698122 0.14696
C  -2.34659 -0.658305 -0.825623
C  -1.198299 0.263605 1.165215
C  -3.273891 0.39522 -0.775239
C  -2.131479 1.311744 1.20987
C  -3.180424 1.395742 0.241548
H  3.310712 1.508358 1.528999
H  4.726252 1.819742 -0.841743
H  4.976738 0.384646 0.231586
H  3.007545 3.527848 0.112516
H  2.098012 2.575734 -1.11117
H  1.394324 2.854152 0.510152
H  1.578479 -2.281715 -1.597707
H  -2.415677 -1.443993 -1.584697
H  -0.380408 0.190789 1.887294
H  -4.078202 0.446178 -1.517715
H  -2.053855 2.073186 1.994246
H  -4.049372 3.144288 1.015949
H  -4.854178 2.49799 -0.387971
