program: Gaussian 09
title: 000222763
version: EM64L-G09RevD.01
frameworkgroup: C1[X(C6H9N3)]
method: RPBEPBE
basis: SDD
operation: Freq
keyword: #p
keyword: freq=noraman
keyword: PBEPBE/SDD
title: #p freq=noraman PBEPBE/SDD
converged: NO YES NO NO
title: Mulliken charges:
elementType: N N N C C C C C C H H H H H H H H H
charge: -0.061494 -0.018174 -0.636480 0.123608 0.118210 -0.769332 -0.764284 0.174598 -0.427669 0.225889 0.225589 0.250562 0.251326 0.221243 0.221072 0.228268 0.323309 0.313760
chargesum: 0.00000
title: Mulliken charges with hydrogens summed into heavy atoms:
elementType: N N N C C C C C C
charge: -0.061494 -0.018174 0.000589 0.123608 0.118210 -0.067292 -0.070643 0.174598 -0.199401
polarizability: 1.25258171e+02 2.49894891e+00 8.75070309e+01 9.56566606e-03 -1.41736249e-02 4.51120706e+01
1716.lowfreq: -13.1395 -8.1276 -0.0008 -0.0008 -0.0005 13.6173 78.7503 98.2225 136.0885
frequency: 78.7466 98.2132 136.0771 217.4844 275.7605 297.9778 323.5905 372.3576 458.0616 459.9759 486.5803 488.6222 562.6525 609.2420 696.4043 753.7307 757.0577 866.3671 935.1488 949.5566 996.9703 1025.4293 1053.1454 1067.0829 1150.9448 1262.2655 1279.6527 1338.2180 1374.0382 1392.6092 1397.1468 1439.5958 1459.8516 1460.7245 1473.2747 1476.6881 1517.0948 1557.3589 1615.0652 2972.3030 2979.5898 3043.8962 3054.9749 3110.5706 3116.2462 3117.6131 3556.8262 3712.2771
redmass: 1.1017 2.5532 1.0879 3.1907 2.4886 2.6801 3.0445 1.2516 2.4306 2.7482 1.5299 5.0358 5.4604 3.2731 7.3672 4.4757 3.5430 1.5897 2.5287 1.8451 1.6162 1.4103 1.6452 2.0056 3.0103 3.5952 3.9292 2.1328 2.1419 1.8785 1.2413 1.7012 1.2643 1.0504 1.0457 1.6512 4.5971 3.8578 1.3872 1.0385 1.0383 1.0972 1.0968 1.0973 1.0982 1.0919 1.0447 1.1045
irintensity: 0.0012 3.8080 0.7723 10.1934 0.6334 8.0043 2.6683 211.9468 5.3091 1.0610 108.8596 1.5304 1.2880 5.4408 1.4333 0.0436 0.1451 22.2101 25.9206 1.3323 3.3239 10.1693 0.0797 7.2291 15.2074 1.6731 18.5229 16.2172 30.8691 43.0870 25.8428 32.0729 14.8910 0.9264 34.3587 99.5784 28.3900 85.3774 305.0725 38.5537 16.6721 32.7539 13.1017 12.7072 10.8746 32.1280 80.4499 35.4651
temp: 298.150 k
press: 1.00000 atm
elementType: 7 7 7 6 6 6 6 6 6 1 1 1 1 1 1 1 1 1
symmnumber: 1
zpe: 381758.6 jmol-1
zpe.correction: 0.145404 hartree
zpe.thermalcorrener: 0.154571 hartree
zpe.thermalcorrenthalpy: 0.155515 hartree
zpe.thermalcorrgfe: 0.111585 hartree
zpe.sumelectzpe: -397.625437 hartree
zpe.sumelectthermal: -397.616270 hartree
zpe.sumelectthermalent: -397.615326 hartree
zpe.sumelectthermalfe: -397.659256 hartree
dipole: -1.4767 0.9418 0.0130
dipole: 1.7515
quadrupole: -36.8716 -57.5397 -55.8847
quadrupole: 3.2457 -0.0508 0.0113
quadrupole: 13.2271 -7.4411 -5.7860 3.2457 -0.0508 0.0113
hfenergy: -397.7708413 hartree
pointgroup: C01 [X(C6H9N3)]
dipole: -0.5823875 -0.3682947 0.005017 debye
dipolederiv: -0.7392855 -0.1986763 0.0092901 0.2709673 -0.2665159 -0.0056058 0.010455 0.0034826 -0.2910708 0.1276243 -0.2741391 -0.0084098 -0.0801496 -0.191256 0.001606 -0.008074 0.0050989 -0.2560789 -1.5269596 -0.293803 0.016757 -0.4075188 -0.1740205 0.0094455 0.0226239 0.0079252 -0.7558383 0.3067362 0.0003348 -0.0061547 -0.5146372 0.5263463 0.0113314 -0.0077301 0.0025103 0.0623513 0.3089414 0.1061482 -0.0041105 0.5021313 -0.3594013 -0.0103451 -0.0035164 -0.0028189 0.0084881 -0.1361428 0.1832172 0.0042906 0.1598953 -0.0992926 -0.00356 0.0050599 -0.005322 0.0436104 -0.1864886 -0.0439338 0.0045913 -0.013027 0.0486895 0.0001293 0.0045965 0.0007817 0.0865343 1.7004366 0.3067447 -0.0301136 0.6413861 -0.0057857 -0.0129082 -0.0308856 -0.0066992 0.2559939 -0.3560832 0.1049956 0.0058056 -0.6943338 0.145676 0.0132733 0.0043935 -0.0019691 -0.1165207 0.0121152 0.0374502 0.1064402 0.0098916 0.0654928 0.0414006 0.1229458 -0.011838 -0.0489963 0.0015679 0.0379874 -0.1087627 0.0081311 0.0660579 -0.0417002 -0.1255701 0.0106639 -0.0387866 0.06321 -0.1362165 0.0011252 -0.030071 -0.0650371 0.0006621 0.0010511 0.0028545 0.1173729 0.0967662 0.019929 0.0004214 -0.0924271 -0.1008485 0.0012995 0.0002368 -0.0007323 0.1178371 -0.035082 0.0031414 -0.0654439 0.0436909 0.0685005 0.0984985 -0.1249704 0.0625235 -0.0519869 -0.0285407 0.0007896 0.0647292 0.0398673 0.069133 -0.0995332 0.1244867 -0.0621963 -0.0592823 -0.0595008 0.1044893 0.0036583 0.1224058 -0.0237212 -0.0023039 0.0036903 -0.0017919 0.1439113 0.2029356 0.0309345 0.0033539 0.0461997 0.1734431 -0.0019538 0.0010702 -0.0023184 0.3829389 0.2477497 0.0106065 0.0025325 -0.0124019 0.1225397 0.0002641 0.000137 -0.0001544 0.3995228 unknown
polarizability: 125.2089426|-2.6415376|87.5265778|-1.5368855|0.1423731|45.1417526 unknown
InChI: InChI=1S/C6H9N3/c1-4-5(2)9-6(7)3-8-4/h3H,7H2,1-2H3
charge 0 multiplicity 1
18 atoms
N  -0.670178 -1.097463 0.03985
N  0.214403 1.5944 0.027871
N  -2.907352 -0.3934 0.086926
C  0.66281 -0.792136 0.015615
C  1.119685 0.561501 0.010225
C  1.626471 -1.957509 -0.007731
C  2.587331 0.924833 -0.014734
C  -1.565345 -0.058599 0.058804
C  -1.106796 1.295502 0.052067
H  2.265182 -1.933094 -0.910967
H  2.305956 -1.935203 0.865241
H  1.060319 -2.90137 0.00393
H  2.684405 2.021747 -0.014785
H  3.125919 0.522494 0.864753
H  3.095235 0.525216 -0.913531
H  -1.807282 2.138974 0.064869
H  -3.156197 -1.379841 0.086166
H  -3.633264 0.315749 0.098732
