program: Gaussian 09
title: 000222762
version: EM64L-G09RevD.01
frameworkgroup: C1[X(C6H8BrN3)]
method: RPBEPBE
basis: SDD
operation: Freq
keyword: #p
keyword: freq=noraman
keyword: PBEPBE/SDD
title: #p freq=noraman PBEPBE/SDD
converged: YES YES NO NO
title: Mulliken charges:
elementType: Br N N N C C C C C C H H H H H H H H
charge: -0.025937 -0.059186 0.075656 -0.622141 0.140193 0.088066 -0.765884 -0.763869 0.267061 -0.412081 0.253214 0.229415 0.229395 0.226347 0.226263 0.256942 0.328218 0.328330
chargesum: 0.00000
title: Mulliken charges with hydrogens summed into heavy atoms:
elementType: Br N N N C C C C C C
charge: -0.025937 -0.059186 0.075656 0.034407 0.140193 0.088066 -0.053860 -0.054318 0.267061 -0.412081
polarizability: 1.66271521e+02 8.21257927e+00 1.07526374e+02 -1.12302896e-03 1.56919705e-02 4.74486862e+01
1716.lowfreq: -22.0636 -12.3941 0.0006 0.0007 0.0007 6.2003 32.2729 65.1883 100.0539
frequency: 25.4644 65.1866 100.0505 160.1411 176.7432 231.0949 251.1981 273.2124 318.0490 370.6843 461.1529 482.5521 487.3210 509.1110 513.6707 592.0901 630.3799 679.9224 753.2696 769.7093 942.9633 950.0675 1025.6007 1030.8593 1051.9014 1071.9403 1155.2321 1275.0215 1333.2356 1366.7961 1394.4643 1401.1553 1440.3470 1450.9012 1459.3600 1470.9425 1473.5487 1494.5944 1553.0202 1616.3321 2976.2645 2981.4427 3048.3591 3056.5579 3114.2424 3119.0364 3539.4778 3693.0552
redmass: 1.0221 4.1419 1.0600 3.5898 6.1250 9.1497 4.7721 2.5193 2.9811 4.1361 2.0395 5.3181 1.5013 2.9888 1.3836 6.0330 4.1377 7.5101 8.0616 4.9696 1.9615 2.0284 1.4054 2.8146 1.6175 1.8571 3.5119 5.3884 5.6914 2.7854 1.5784 1.3052 2.0278 1.5409 1.0470 1.0457 1.4548 3.0461 2.7905 1.7938 1.0387 1.0388 1.0974 1.0969 1.0973 1.0979 1.0445 1.1053
irintensity: 0.0284 0.2118 2.0962 7.9086 0.1459 15.7062 1.0143 0.6177 3.6359 1.3226 118.6500 11.5221 118.8437 1.5652 69.5369 0.2441 4.6612 1.8895 6.4273 16.8895 35.7518 126.8438 7.2516 45.8665 0.0988 8.7507 17.7979 19.6437 4.0765 66.9208 77.6744 2.9802 102.6475 13.4994 0.1034 37.7144 80.1729 19.1530 9.8009 368.7159 36.0760 15.6051 29.5021 9.6218 9.6680 8.7748 90.9752 48.4001
temp: 298.150 k
press: 1.00000 atm
elementType: 35 7 7 7 6 6 6 6 6 6 1 1 1 1 1 1 1 1
symmnumber: 1
zpe: 354918.4 jmol-1
zpe.correction: 0.135181 hartree
zpe.thermalcorrener: 0.145942 hartree
zpe.thermalcorrenthalpy: 0.146886 hartree
zpe.thermalcorrgfe: 0.096965 hartree
zpe.sumelectzpe: -410.420519 hartree
zpe.sumelectthermal: -410.409758 hartree
zpe.sumelectthermalent: -410.408814 hartree
zpe.sumelectthermalfe: -410.458735 hartree
dipole: -1.9338 2.0246 0.0140
dipole: 2.7998
quadrupole: -59.4602 -63.9899 -70.3359
quadrupole: 8.4469 0.0231 0.0466
quadrupole: 5.1351 0.6054 -5.7406 8.4469 0.0231 0.0466
hfenergy: -410.5557 hartree
pointgroup: C01 [X(C6H8Br1N3)]
dipole: 0.5218531 0.9700228 -0.0098842 debye
dipolederiv: -0.9503521 -0.3565813 0.0135866 -0.4113082 -0.3102337 0.0061693 0.0125162 0.0050362 -0.0898499 -0.5126289 0.4256257 0.0046167 -0.3137021 -0.4478388 0.0045957 0.0016144 -0.0078174 -0.2679127 -0.4167953 -0.0368517 0.0036754 0.3512536 -0.2473865 -0.0065246 0.0069097 -0.0000594 -0.1703759 -0.9919232 0.6767701 0.0086152 0.7110317 -0.7130264 -0.0135067 0.0090674 -0.0132552 -0.7040524 0.4253422 -0.0057389 -0.0052487 0.6602131 0.3689261 -0.0103029 -0.0011137 0.0024795 0.0582114 0.1647584 -0.2146641 -0.0045285 -0.8235142 -0.0257021 0.0150044 -0.0074407 0.0032993 0.002688 -0.240021 -0.1132126 0.0040881 -0.093551 0.0263752 0.0014018 0.0036279 0.0014268 0.0463547 -0.1417343 0.1236536 0.0046979 0.0898673 -0.0177248 -0.0021658 0.0042447 -0.0026316 0.0755536 0.6803113 -0.9857594 -0.0099048 -1.0706929 0.6848171 0.0203609 -0.0093802 0.0164707 0.2559381 1.4208601 0.5777977 -0.0233992 0.9936087 0.1086288 -0.0167162 -0.0220057 -0.0080477 -0.0430667 0.1059184 0.0699347 0.0007511 -0.0459399 -0.0976451 -0.0008338 -0.0001918 -0.0028663 0.1208178 -0.0082264 -0.0151923 -0.0789149 0.0183898 0.0724646 0.0816867 -0.1187701 0.0368681 -0.0341126 -0.0017287 -0.017534 0.0777573 0.0140371 0.0744928 -0.0803467 0.1181044 -0.0345545 -0.0426818 -0.0257061 0.0347327 0.0934247 0.0046489 0.0684191 0.0658151 0.1335438 0.0116359 -0.0507153 -0.0342012 0.0351757 -0.0937407 0.0035631 0.0691838 -0.0648836 -0.1341939 -0.0117851 -0.0431195 0.0988355 -0.0968645 -0.0000258 0.01064 -0.0761961 -0.001169 0.0004919 0.000806 0.1226597 0.2549476 -0.0548249 0.0014007 -0.0310689 0.2341076 0.0001963 0.0006501 0.0010375 0.3833202 0.1723439 -0.0464665 0.0031489 -0.0674761 0.2283385 0.001219 0.0023255 0.0019572 0.3803431 unknown
polarizability: 166.2984354|7.99172|107.4632586|-2.0372697|0.1392405|47.4848869 unknown
InChI: InChI=1S/C6H8BrN3/c1-3-4(2)10-6(8)5(7)9-3/h8H2,1-2H3
charge 0 multiplicity 1
18 atoms
Br -2.975762 -1.463443 0.079666
N  0.135634 1.424707 0.039244
N  -0.105709 -1.359785 0.028865
N  -2.205154 1.667367 0.078124
C  1.247945 0.631469 0.015102
C  1.145269 -0.794297 0.008852
C  2.588486 1.328609 -0.001719
C  2.343628 -1.711455 -0.017748
C  -1.105672 0.843767 0.058399
C  -1.178175 -0.587396 0.053115
H  2.438841 2.418785 0.009106
H  3.200843 1.044345 0.874763
H  3.171126 1.058145 -0.902514
H  2.965244 -1.545754 -0.918256
H  2.998416 -1.554632 0.860576
H  2.001905 -2.757992 -0.016523
H  -3.144317 1.276482 0.090166
H  -2.05675 2.67398 0.075684
