program: Gaussian 09
title: 000222723
version: EM64L-G09RevD.01
frameworkgroup: C1[X(C16H31NO)]
method: RPBEPBE
basis: SDD
operation: Freq
keyword: #p
keyword: freq=noraman
keyword: PBEPBE/SDD
title: #p freq=noraman PBEPBE/SDD
converged: NO YES NO NO
title: Mulliken charges:
elementType: O N C C C C C C C C C C C C C C C C H H H H H H H H H H H H H H H H H H H H H H H H H H H H H H H
charge: -0.304542 -0.109247 0.306267 0.352214 -0.205495 -0.057827 -0.556949 -0.534760 -0.483350 -0.829357 -0.787415 -0.790936 -0.249582 -0.392422 -0.325496 -0.323295 -0.673567 -0.672089 0.237550 0.211565 0.250463 0.222704 0.235477 0.209429 0.227467 0.202947 0.214490 0.206128 0.235523 0.211922 0.230610 0.213100 0.237721 0.210157 0.210989 0.178509 0.202054 0.213003 0.208188 0.188372 0.206837 0.187938 0.202751 0.205794 0.207855 0.226014 0.205302 0.210853 0.226134
chargesum: 0.00000
title: Mulliken charges with hydrogens summed into heavy atoms:
elementType: O N C C C C C C C C C C C C C C C C
charge: -0.304542 -0.109247 0.306267 0.352214 0.032055 0.153738 -0.083782 -0.089854 -0.052935 -0.173216 -0.131783 -0.132070 0.130981 0.028769 0.069714 0.067394 -0.033903 -0.029800
polarizability: 2.11526312e+02 6.01515343e-01 1.72119511e+02 1.09788968e-01 1.87741239e-01 1.57032242e+02
1716.lowfreq: -20.4110 -11.9000 -8.4074 -0.0008 -0.0006 0.0002 8.1905 20.3690 38.8728
frequency: -11.1956 17.7975 38.2433 53.6979 77.0992 78.6996 99.1516 129.4151 158.2547 163.1338 181.4123 196.9509 208.6875 214.8931 221.2306 224.6765 247.1002 275.6105 279.9642 295.2406 314.2908 341.8647 353.5766 383.7907 409.0895 418.6374 449.2566 454.1424 472.0014 509.9522 532.3717 571.3457 583.4687 639.5585 733.9458 741.6972 777.7985 792.3881 794.6227 805.0917 817.9211 830.8548 880.7408 911.0264 914.1292 928.6643 936.0475 942.3251 955.0175 959.8878 983.0157 988.3759 997.3500 1031.0796 1032.0781 1053.1919 1062.6940 1065.4522 1075.0969 1076.8850 1084.4091 1094.0881 1107.1812 1123.5605 1135.2237 1149.8881 1159.8748 1163.3218 1196.9406 1204.0275 1206.9130 1219.2291 1226.1823 1229.5565 1245.8825 1261.8513 1269.7183 1274.0802 1281.6286 1291.5405 1292.1395 1299.4766 1314.7329 1317.9312 1350.0443 1361.7627 1369.4309 1377.8247 1382.0521 1382.6401 1386.8504 1392.9082 1396.9279 1456.0030 1459.9596 1460.8433 1462.6814 1469.7074 1470.0550 1471.7842 1474.4414 1475.9826 1480.2880 1482.4495 1485.6917 1486.1760 1488.5533 1490.9014 1493.7735 1498.5885 2849.9363 2858.9293 2906.5885 2923.9127 2933.3279 2968.3674 2974.1355 2978.3289 2981.0312 2982.2123 2989.9528 2998.4731 3003.2654 3013.0379 3022.6983 3031.2648 3042.6009 3051.3889 3053.2306 3056.1021 3056.8254 3058.5408 3063.0270 3069.3319 3073.5229 3075.0668 3086.1493 3088.4538 3090.2876 3090.6172 3095.4867
redmass: 3.3337 3.2889 3.1698 2.9629 2.1967 2.4336 2.0499 1.7945 2.0045 1.6677 1.5298 1.1346 1.4828 1.4881 1.5998 1.7583 2.0384 2.0987 2.3295 2.1929 2.3560 2.4531 2.4403 2.6067 2.1804 2.7281 2.5402 2.8409 2.6858 2.9421 3.5221 3.9393 3.3636 3.3843 2.5767 2.7367 2.1604 1.1375 1.1901 1.2388 1.7078 2.0482 2.2841 2.2541 1.9125 1.8567 1.6030 1.5847 2.0873 2.2769 2.4725 2.0693 1.5904 2.4209 2.1883 2.3862 2.5615 1.6889 1.9276 1.2555 2.1499 2.7272 1.5510 1.6920 2.2451 2.1537 1.4812 1.6800 1.8923 1.7064 2.2277 1.8265 1.9363 1.7191 1.7015 1.5336 1.9078 1.1223 1.2013 1.2406 1.5140 1.5162 1.9838 1.3339 1.3503 1.3401 1.3500 1.2172 1.2467 1.2371 1.2358 1.4021 1.2168 1.0753 1.0550 1.0603 1.0537 1.0613 1.0617 1.0546 1.0613 1.0577 1.0591 1.0550 1.0757 1.0652 1.0783 1.0749 1.0714 1.0594 1.0720 1.0713 1.0703 1.0619 1.0822 1.0363 1.0377 1.0377 1.0355 1.0358 1.0979 1.0610 1.0621 1.0659 1.0876 1.0873 1.0887 1.1001 1.1022 1.0919 1.0979 1.0978 1.1027 1.0985 1.0985 1.0981 1.0971 1.0989 1.1003 1.1003 1.0960
irintensity: 0.0115 0.2200 0.2308 0.0777 0.2126 0.1226 0.2425 2.2631 0.4851 0.8788 1.5781 0.3648 0.3182 0.4795 1.0219 0.7787 0.1451 1.2144 2.4231 1.4054 1.3806 0.4842 1.0674 0.8360 0.8051 2.8587 3.0315 6.0075 2.3835 2.6959 2.8663 1.4687 0.2521 1.1941 4.6017 7.7585 3.4277 5.5096 5.0788 1.4954 8.2242 0.4838 1.1435 2.0708 0.3861 2.6585 2.4703 2.2283 0.7231 15.0871 5.2063 3.6562 11.0736 50.4588 62.2188 41.0472 95.4488 37.0996 17.6825 4.7216 2.9322 4.2486 42.6116 6.1532 10.4799 4.2779 2.5238 2.2072 4.5422 3.8410 30.1650 5.3769 7.1031 16.7096 2.8200 0.6699 3.7793 0.9625 15.4757 22.9557 1.4785 1.2311 5.0661 6.4327 8.0690 1.6958 7.7252 11.8626 22.1195 14.0687 22.3676 5.9213 22.7769 0.7118 2.6941 4.8667 5.9228 1.0171 20.5249 6.2815 2.8339 3.7070 14.5727 6.9404 4.4026 7.2965 14.4224 5.4743 19.1844 7.4772 33.7359 170.4808 73.9146 42.9133 67.0498 31.1494 21.8174 67.6914 32.5035 30.0187 31.9994 37.2300 37.8681 54.8108 16.1881 21.3007 46.8999 2.3313 24.4908 26.9096 35.0050 70.2066 51.5607 18.5619 39.1634 84.8331 21.6097 73.3709 23.9578 58.5071 24.1791
temp: 298.150 k
press: 1.00000 atm
elementType: 8 7 6 6 6 6 6 6 6 6 6 6 6 6 6 6 6 6 1 1 1 1 1 1 1 1 1 1 1 1 1 1 1 1 1 1 1 1 1 1 1 1 1 1 1 1 1 1 1
symmnumber: 1
zpe: 1159216.0 jmol-1
zpe.correction: 0.441522 hartree
zpe.thermalcorrener: 0.461930 hartree
zpe.thermalcorrenthalpy: 0.462875 hartree
zpe.thermalcorrgfe: 0.392648 hartree
zpe.sumelectzpe: -756.755913 hartree
zpe.sumelectthermal: -756.735505 hartree
zpe.sumelectthermalent: -756.734560 hartree
zpe.sumelectthermalfe: -756.804787 hartree
dipole: 0.4585 -0.4771 -0.4384
dipole: 0.7938
quadrupole: -107.8481 -112.8843 -115.9365
quadrupole: 0.0697 3.2045 0.2179
quadrupole: 4.3749 -0.6613 -3.7135 0.0697 3.2045 0.2179
hfenergy: -757.1974351 hartree
pointgroup: C01 [X(C16H31N1O1)]
dipole: -0.1355692 -0.1358197 -0.2463659 debye
polarizability: 210.170278|6.8066131|158.8140205|4.7802842|-2.9916095|171.6937661 unknown
InChI: InChI=1S/C16H31NO/c1-6-17(7-2)10-11-18-14-12-13-8-9-16(14,5)15(13,3)4/h13-14H,6-12H2,1-5H3
charge 0 multiplicity 1
49 atoms
O  -0.157256 0.44387 0.193416
N  -3.75804 -0.379914 -0.427268
C  2.256708 1.005225 0.155805
C  3.560601 0.098481 0.144933
C  2.962569 -0.927578 1.178459
C  1.163244 -0.043689 -0.227918
C  2.072219 1.293174 1.684276
C  1.629301 -1.358569 0.495799
C  2.581055 -0.01754 2.38395
C  2.242933 2.255936 -0.72643
C  3.907207 -0.523859 -1.231539
C  4.831658 0.827624 0.642921
C  -1.26724 -0.331754 -0.371238
C  -2.568121 0.301452 0.144297
C  -4.15712 0.182339 -1.745953
C  -4.88981 -0.490484 0.530638
C  -4.912935 -0.828682 -2.62956
C  -4.655103 -1.562611 1.611843
H  3.625183 -1.770713 1.441312
H  1.136089 -0.181254 -1.331515
H  1.014442 1.506241 1.906283
H  2.664037 2.176991 1.984346
H  1.772476 -2.19463 -0.211466
H  0.878927 -1.674987 1.243294
H  3.4515 0.176739 3.0360
H  1.800968 -0.48744 3.009317
H  3.028689 2.97239 -0.422039
H  2.401947 2.007041 -1.793438
H  1.266883 2.768266 -0.645007
H  4.784954 -1.190932 -1.135269
H  3.08876 -1.118639 -1.670326
H  4.173155 0.26693 -1.958718
H  4.686051 1.356666 1.598672
H  5.656189 0.102528 0.782969
H  5.169763 1.571383 -0.103396
H  -1.223232 -0.303282 -1.483523
H  -1.218774 -1.394078 -0.053396
H  -2.581645 0.208205 1.244422
H  -2.55361 1.393528 -0.082455
H  -4.770175 1.111828 -1.623757
H  -3.233458 0.487318 -2.272706
H  -5.112969 0.493955 1.016003
H  -5.792551 -0.765853 -0.044795
H  -5.154425 -0.380081 -3.611495
H  -5.863528 -1.151678 -2.167803
H  -4.292578 -1.727405 -2.791316
H  -5.526919 -1.626183 2.289834
H  -3.766943 -1.336135 2.229642
H  -4.498275 -2.548336 1.140293
