program: Gaussian 09
title: 000222712
version: EM64L-G09RevD.01
frameworkgroup: C1[X(C14H19N3O2)]
method: RPBEPBE
basis: SDD
operation: Freq
keyword: #p
keyword: freq=noraman
keyword: PBEPBE/SDD
title: #p freq=noraman PBEPBE/SDD
converged: YES YES NO NO
title: Mulliken charges:
elementType: O O N N N C C C C C C C C C C C C C C H H H H H H H H H H H H H H H H H H H
charge: -0.230818 -0.226223 -0.404711 -0.401701 -0.064909 0.140167 -0.402937 -0.385626 -0.375386 0.154466 0.109532 -0.358630 0.140870 -0.357305 -0.300267 -0.696181 -0.194871 -0.370543 -0.171307 0.219680 0.231619 0.210208 0.216374 0.197067 0.192690 0.352454 0.190093 0.192459 0.350466 0.195526 0.196858 0.287031 0.216754 0.209612 0.211051 0.243507 0.246943 0.235987
chargesum: 0.00000
title: Mulliken charges with hydrogens summed into heavy atoms:
elementType: O O N N N C C C C C C C C C C C C C C
charge: -0.230818 -0.226223 -0.052257 -0.051235 -0.064909 0.140167 0.048363 0.040956 0.014372 0.154466 0.109532 0.023922 0.140870 0.035080 -0.013236 -0.058764 0.048635 -0.123601 0.064681
polarizability: 1.61887931e+02 8.07578310e+00 1.87687437e+02 -2.62341979e+00 4.57191613e+00 1.64990967e+02
1716.lowfreq: -14.6720 -6.6880 -2.5777 0.0005 0.0005 0.0008 23.4703 28.1208 42.7502
frequency: 22.9185 27.0238 42.7085 54.4561 64.9914 72.5432 109.4983 116.4068 132.1998 139.6810 163.8564 178.3535 199.2822 233.7928 253.2634 262.8945 315.2105 341.3885 374.1319 407.2215 418.9372 423.3010 492.5303 554.5533 581.4674 606.6277 615.0687 626.6577 649.4049 673.3909 701.3242 721.7851 730.1917 734.8482 752.6722 760.5489 790.5175 800.9537 868.1668 889.1285 912.6101 929.4767 963.3611 964.2103 967.8705 988.0627 996.9177 1009.0891 1010.8929 1041.8478 1056.8465 1066.4636 1080.6593 1084.6939 1109.4838 1121.1737 1149.1278 1168.6861 1193.4215 1211.6422 1225.4542 1237.5785 1256.6447 1280.4751 1283.4747 1288.6955 1294.0529 1298.4007 1307.6890 1310.6627 1322.0785 1330.3129 1350.8014 1352.9084 1368.9515 1389.4628 1413.0856 1448.9533 1454.0006 1461.2570 1463.4164 1471.8823 1477.8619 1480.6750 1487.4454 1563.6732 1581.6500 1672.8441 1721.1808 2952.1688 2956.5962 2968.0629 2972.6930 2977.3880 2985.1164 2989.7020 3005.6826 3025.3313 3036.6824 3057.7019 3069.3573 3072.3474 3135.5919 3145.4310 3162.0324 3175.1439 3547.2943 3587.0845
redmass: 3.4534 1.7455 4.4794 5.7307 4.7975 3.7010 1.6405 4.6198 4.0839 2.7135 6.3808 3.6625 5.1299 1.1126 4.1053 3.4244 4.1984 6.0788 5.9872 3.5088 3.1362 3.9255 3.2652 2.0564 2.1617 8.2874 6.8227 3.9465 1.5309 2.8559 6.4798 1.0861 1.9207 2.4281 2.2942 1.5853 1.4044 2.6736 1.4424 1.9007 1.3058 2.3552 2.0450 2.8499 2.8752 2.0262 2.3605 1.6272 2.4521 2.2616 3.2900 2.5646 2.1644 1.8494 2.1910 2.4204 2.7641 1.0855 1.7403 2.5770 2.1720 1.5999 1.4771 1.3186 1.1118 1.2283 1.6190 1.3355 1.7310 2.4258 4.0041 1.7541 1.5617 1.6755 1.6404 1.2161 1.9669 1.3129 1.5818 1.0700 1.0771 1.0772 1.0423 1.0795 1.0870 6.1110 5.5274 8.8167 9.8286 1.0588 1.0588 1.0590 1.0365 1.0592 1.0588 1.0975 1.1008 1.1023 1.1037 1.1045 1.1008 1.0992 1.0879 1.0903 1.0950 1.1016 1.0782 1.0804
irintensity: 0.5347 0.0974 0.0282 1.2630 0.1685 0.1957 0.0467 2.5029 0.4973 0.5595 2.6162 2.8876 3.5127 0.0062 0.2317 1.0256 1.6681 1.0580 15.1867 2.0024 4.5851 3.8360 6.9916 52.7128 65.6160 26.6232 6.0732 12.9731 115.0141 50.8477 25.1336 10.7684 19.7440 45.1511 7.7818 30.7918 20.5946 24.9094 5.4541 4.4209 0.5866 5.4903 0.7812 20.8217 6.4929 12.7392 2.4018 1.2698 1.6756 5.9645 8.3573 2.6672 0.9463 11.6505 11.2991 9.7902 4.7396 2.2695 2.5414 66.9652 10.4110 21.7770 4.5912 5.6720 6.8556 14.5509 32.9557 17.1847 86.3073 55.8511 12.6905 34.7777 6.9831 1.2181 23.8080 11.0645 25.1160 10.2513 36.6283 0.1466 1.3923 1.7556 12.4858 3.7440 21.3438 9.1761 40.1211 448.0800 520.3312 0.2303 12.5380 70.0066 34.6521 13.3229 51.1170 0.1670 0.5054 9.2433 26.8534 69.8335 98.3376 53.6116 6.1609 12.8980 4.8556 23.6803 82.7340 72.7723
temp: 298.150 k
press: 1.00000 atm
elementType: 8 8 7 7 7 6 6 6 6 6 6 6 6 6 6 6 6 6 6 1 1 1 1 1 1 1 1 1 1 1 1 1 1 1 1 1 1 1
symmnumber: 1
zpe: 821520.0 jmol-1
zpe.correction: 0.312900 hartree
zpe.thermalcorrener: 0.331814 hartree
zpe.thermalcorrenthalpy: 0.332758 hartree
zpe.thermalcorrgfe: 0.263222 hartree
zpe.sumelectzpe: -858.210963 hartree
zpe.sumelectthermal: -858.192050 hartree
zpe.sumelectthermalent: -858.191106 hartree
zpe.sumelectthermalfe: -858.260642 hartree
dipole: 2.0045 4.0926 1.1292
dipole: 4.6949
quadrupole: -117.7754 -105.6570 -123.0065
quadrupole: -9.9837 -4.0444 -7.5003
quadrupole: -2.2958 9.8227 -7.5269 -9.9837 -4.0444 -7.5003
hfenergy: -858.5238638 hartree
pointgroup: C01 [X(C14H19N3O2)]
dipole: 0.7248697 1.649564 0.4066838 debye
polarizability: 161.1294918|6.9475166|188.4718025|-2.8580811|3.976815|164.9650417 unknown
InChI: InChI=1S/C14H19N3O2/c1-2-3-4-6-9-14(11-8-5-7-10-15-11)12(18)16-13(19)17-14/h5,7-8,10,16-17H,2-4,6,9H2,1H3
charge 0 multiplicity 1
38 atoms
O  -2.119341 -1.012191 2.43468
O  -2.577923 -3.096126 -1.768995
N  -1.122239 -1.370853 -0.99086
N  -2.53496 -2.304718 0.488423
N  -1.141926 1.30922 -1.264715
C  -0.917745 -0.609185 0.254739
C  0.519246 -0.806123 0.851678
C  1.657308 -0.292906 -0.053206
C  3.048081 -0.535159 0.577082
C  -1.930648 -1.290736 1.224976
C  -1.214416 0.883433 0.032305
C  4.207619 -0.02822 -0.309504
C  -2.11285 -2.337153 -0.888679
C  5.600802 -0.258159 0.319382
C  -1.490218 1.75718 1.111386
C  6.754045 0.250029 -0.572478
C  -1.705296 3.12431 0.831825
C  -1.346074 2.633893 -1.519073
C  -1.630289 3.576389 -0.506158
H  0.658255 -1.888639 1.04197
H  0.542874 -0.298014 1.835254
H  1.606474 -0.803648 -1.035228
H  1.529313 0.789046 -0.251672
H  3.182324 -1.61982 0.77074
H  3.096304 -0.033758 1.566346
H  -0.900333 -0.926155 -1.884792
H  4.071415 1.055264 -0.509461
H  4.164439 -0.533994 -1.29658
H  -3.238122 -2.94819 0.852621
H  5.643322 0.24754 1.305635
H  5.736047 -1.340754 0.519218
H  -1.553572 1.360242 2.129189
H  7.738747 0.071529 -0.102956
H  6.661097 1.336407 -0.76028
H  6.750241 -0.260569 -1.553936
H  -1.931279 3.823646 1.643604
H  -1.278692 2.935806 -2.570083
H  -1.789729 4.628334 -0.761695
