program: Gaussian 09
title: 000222709
version: EM64L-G09RevD.01
frameworkgroup: C1[X(C12H17NO)]
method: RPBEPBE
basis: SDD
operation: Freq
keyword: #p
keyword: freq=noraman
keyword: PBEPBE/SDD
title: #p freq=noraman PBEPBE/SDD
converged: NO YES NO YES
title: Mulliken charges:
elementType: O N C C C C C C C C C C C C H H H H H H H H H H H H H H H H H
charge: -0.215566 0.005381 -0.357876 -0.383352 -0.352531 -0.520718 -0.356184 0.124136 -0.695536 0.273088 -0.268047 -0.452985 -0.181178 -0.340161 0.185022 0.185000 0.217233 0.217190 0.190268 0.190274 0.238338 0.238363 0.194151 0.194153 0.210484 0.210484 0.215660 0.285886 0.262975 0.237547 0.248501
chargesum: 0.00000
title: Mulliken charges with hydrogens summed into heavy atoms:
elementType: O N C C C C C C C C C C C C
charge: -0.215566 0.005381 0.012146 0.051071 0.028011 -0.044017 0.032119 0.124136 -0.058909 0.273088 0.017838 -0.190010 0.056370 -0.091659
polarizability: 1.95233808e+02 6.37854142e+00 1.32734811e+02 -1.30188944e-02 5.48702825e-03 8.24151861e+01
1716.lowfreq: -0.0004 0.0004 0.0007 3.3472 6.9790 8.7501 27.2847 39.5999 49.8992
frequency: 27.2579 39.5196 49.8750 55.1168 92.2766 115.1053 133.3447 140.6672 160.0223 199.8020 231.3114 243.7336 330.0123 365.4128 400.1555 409.6921 435.4861 489.4023 570.5732 606.6779 672.6841 716.2832 720.1460 734.8506 783.3800 790.2011 825.9023 880.7731 889.8346 927.0415 963.0427 969.7605 980.2907 1003.7226 1011.5236 1012.1861 1027.4748 1056.5110 1072.6348 1084.7406 1096.9665 1101.6787 1121.5760 1189.8728 1191.3865 1213.5366 1240.6401 1246.2906 1280.8905 1290.0650 1291.8324 1295.7110 1310.5974 1328.9382 1338.1869 1357.3068 1361.7269 1389.3874 1405.2579 1430.3722 1460.5278 1461.6891 1464.2380 1471.6300 1476.8297 1480.4801 1488.0367 1544.8367 1575.5529 1601.1043 2947.9754 2955.9585 2956.3624 2966.6140 2971.0524 2986.1741 2994.6182 3000.0880 3003.6493 3029.2872 3057.6962 3067.7778 3070.1705 3134.4353 3139.5856 3152.2028 3171.4950
redmass: 3.5222 1.8577 4.4001 4.0679 2.1712 1.9907 4.0282 2.4907 2.7953 4.9841 1.1124 3.9342 4.3995 2.7400 4.5333 3.8939 3.6729 4.0637 2.3800 7.8580 6.7287 1.9425 1.0933 1.1345 6.1393 1.3035 1.4838 1.3560 1.9189 1.3968 1.4247 5.3564 1.2785 3.5345 1.3652 3.9290 3.3191 2.6428 2.4705 2.0713 1.4211 1.6043 2.6051 1.4557 1.6549 1.5534 1.3249 1.6159 1.0915 1.1118 1.5543 1.0894 9.6846 1.4116 1.4473 1.6315 1.6897 1.2176 1.9891 1.1299 1.8830 1.1022 1.0811 1.0742 1.0424 1.0793 1.0854 5.5970 5.9513 8.5610 1.0591 1.0593 1.0595 1.0591 1.0364 1.0979 1.0602 1.0973 1.1013 1.1043 1.1033 1.1007 1.0993 1.0877 1.0917 1.0914 1.1002
irintensity: 0.4179 0.9576 0.0960 4.0001 2.6636 0.5319 0.9916 0.4908 0.0696 2.3410 0.0034 6.9194 5.2511 0.8834 2.0001 0.9968 3.0486 2.5931 0.4050 2.4805 5.9853 23.5207 28.9805 0.4478 2.9142 22.4714 18.0772 0.4795 2.5023 1.1722 1.0273 51.4176 0.5307 8.0795 0.5213 1.6867 6.5386 0.6440 0.0863 0.5600 0.3666 12.1517 14.0827 3.9103 0.0091 30.5728 0.0929 91.0290 0.1930 0.0000 64.9713 0.3881 2.9786 7.0906 27.4710 12.9952 15.0495 10.4691 34.1210 19.4221 1.4254 1.0590 0.5103 2.5767 12.4843 3.9370 20.9593 9.3432 80.3960 66.8025 6.9071 6.7748 30.1799 88.8574 36.4758 3.1125 29.3224 6.9080 0.0279 40.3203 54.1644 104.2032 53.5625 15.8965 13.2623 4.7739 22.4389
temp: 298.150 k
press: 1.00000 atm
elementType: 8 7 6 6 6 6 6 6 6 6 6 6 6 6 1 1 1 1 1 1 1 1 1 1 1 1 1 1 1 1 1
symmnumber: 1
zpe: 689830.9 jmol-1
zpe.correction: 0.262743 hartree
zpe.thermalcorrener: 0.277636 hartree
zpe.thermalcorrenthalpy: 0.278581 hartree
zpe.thermalcorrgfe: 0.218501 hartree
zpe.sumelectzpe: -596.378814 hartree
zpe.sumelectthermal: -596.363920 hartree
zpe.sumelectthermalent: -596.362976 hartree
zpe.sumelectthermalfe: -596.423055 hartree
dipole: -0.2113 -0.4433 0.0022
dipole: 0.4911
quadrupole: -74.4082 -94.7695 -85.6358
quadrupole: -8.7906 -0.0069 0.0048
quadrupole: 10.5296 -9.8317 -0.6980 -8.7906 -0.0069 0.0048
hfenergy: -596.6415566 hartree
pointgroup: C01 [X(C12H17N1O1)]
dipole: -0.0838 0.1740868 -0.0012091 debye
polarizability: 195.2823474|-6.1358015|132.6859726|-0.06985|-0.109617|82.4154846 unknown
InChI: InChI=1S/C12H17NO/c1-2-3-4-5-8-12(14)11-7-6-9-13-10-11/h6-7,9-10H,2-5,8H2,1H3
charge 0 multiplicity 1
31 atoms
O  -0.601916 -2.017193 0.006005
N  -3.696686 1.728938 -0.000995
C  2.96986 0.49144 -0.004248
C  1.791145 -0.506381 -0.001099
C  4.3485 -0.206798 -0.003964
C  0.423045 0.199836 -0.001277
C  5.53572 0.78278 -0.006906
C  -0.765465 -0.762487 0.002365
C  6.908816 0.07669 -0.006541
C  -2.162322 -0.191871 0.002016
C  -3.268888 -1.083184 0.004629
C  -2.436667 1.202359 -0.000701
C  -4.575515 -0.558838 0.004355
C  -4.741679 0.847756 0.001491
H  2.896823 1.152248 -0.894107
H  2.898368 1.156006 0.882933
H  1.858984 -1.169343 0.882611
H  1.857377 -1.172999 -0.882181
H  4.425023 -0.867232 0.885047
H  4.423593 -0.870841 -0.890401
H  0.334749 0.868955 0.880775
H  0.332712 0.864886 -0.886172
H  5.459911 1.445911 0.879315
H  5.458548 1.442309 -0.895694
H  7.024371 -0.564948 0.887523
H  7.023006 -0.568523 -0.898202
H  7.739683 0.806188 -0.008636
H  -3.071219 -2.160214 0.006816
H  -1.625483 1.938805 -0.002693
H  -5.450848 -1.215688 0.006294
H  -5.741549 1.296534 0.001143
