program: Gaussian 09
title: 000222715
version: EM64L-G09RevD.01
frameworkgroup: C1[X(C21H17NO)]
method: RPBEPBE
basis: SDD
operation: Freq
keyword: #p
keyword: freq=noraman
keyword: PBEPBE/SDD
title: #p freq=noraman PBEPBE/SDD
converged: YES YES NO NO
title: Mulliken charges:
elementType: O N C C C C C C C C C C C C C C C C C C C C C H H H H H H H H H H H H H H H H H
charge: -0.215961 -0.213384 -0.458257 0.233523 0.253215 0.109107 0.496696 -0.584614 -0.398153 -0.337112 0.516314 -0.255858 -0.401462 -0.377935 -0.224879 -0.453077 -0.351455 -0.232772 -0.238639 -0.242314 -0.218270 -0.229198 -0.241791 0.270050 0.233057 0.266270 0.253680 0.255685 0.228856 0.238911 0.248079 0.226162 0.230677 0.249339 0.225903 0.225604 0.228174 0.227086 0.228837 0.229904
chargesum: 0.00000
title: Mulliken charges with hydrogens summed into heavy atoms:
elementType: O N C C C C C C C C C C C C C C C C C C C C C
charge: -0.215961 -0.213384 -0.188207 0.233523 0.253215 0.109107 0.496696 -0.085287 -0.144473 -0.081427 0.516314 -0.027002 -0.162551 -0.129856 0.001283 -0.222400 -0.102116 -0.006868 -0.013035 -0.014141 0.008816 -0.000361 -0.011887
polarizability: 2.68531276e+02 -3.20732278e+01 2.09737761e+02 1.17702614e+01 -4.05389216e+00 1.90424202e+02
1716.lowfreq: -14.7775 -6.9903 -0.0004 0.0003 0.0006 4.2180 11.5483 19.8981 21.5231
frequency: -7.7319 19.7221 21.4281 37.1224 57.5525 67.9765 112.2309 139.4634 168.3087 207.4218 239.9212 252.2642 256.3193 301.2060 323.1271 378.4024 402.7820 403.2088 432.6516 458.4335 474.9897 486.5370 495.2880 547.6381 561.2959 602.7042 615.3702 616.7733 631.2735 653.8489 692.9914 702.8343 705.9003 722.7392 736.9588 758.9045 761.0062 793.9497 812.7842 833.8663 852.7778 855.4529 866.6325 876.7981 891.4700 921.4939 930.0801 941.3271 977.5896 978.6670 979.7171 990.1275 990.9054 995.7523 997.1555 1008.9039 1024.6786 1027.3360 1029.5900 1053.9264 1081.0635 1087.2661 1095.7950 1164.0940 1169.1732 1172.8053 1173.1029 1178.1146 1188.9208 1191.7088 1194.0890 1205.8299 1212.2167 1259.8552 1277.7945 1304.2865 1323.2616 1331.6885 1337.5643 1363.2983 1382.2099 1387.4328 1408.5844 1440.5090 1442.9466 1452.6193 1461.0189 1481.1957 1484.5866 1486.9077 1592.6899 1596.0498 1602.0376 1611.8134 1614.7357 1623.5535 1651.8024 2986.3192 2993.0390 3041.1253 3112.4650 3122.5714 3125.1289 3127.9904 3130.7260 3135.6686 3139.4700 3140.6927 3147.0879 3149.0067 3157.7776 3164.1758 3164.3958 3170.0741
redmass: 4.3735 4.1923 4.4124 5.0360 5.2140 5.0904 7.2539 4.2948 4.6024 4.3678 4.8826 5.0444 6.1622 3.1069 4.1164 3.8463 2.8127 2.8135 3.5135 3.4722 5.1177 4.8451 4.5954 5.2834 3.9956 5.7394 6.2993 6.2298 4.7188 5.7382 5.1502 2.1423 1.8423 2.2459 2.1001 1.6803 1.9742 2.9665 3.8341 2.7960 1.2583 1.2498 1.7961 2.5601 2.8603 1.5332 1.6281 1.4128 1.3909 1.3801 1.3369 6.0646 5.5083 1.3355 1.3614 2.5983 2.4121 2.2490 2.1992 4.3431 1.7319 1.7585 1.8185 1.7013 1.1928 1.0574 1.0560 1.2709 1.1158 1.1362 2.0143 1.7287 2.0981 2.5289 1.6062 1.6421 2.9665 1.3471 1.4863 1.7204 8.0494 4.8194 4.0816 2.2051 2.1195 1.7615 1.4540 2.5327 2.2637 2.8487 6.1904 6.1239 7.3069 6.2156 6.0158 7.6138 10.6999 1.0587 1.0821 1.1026 1.0876 1.0845 1.0860 1.0878 1.0856 1.0911 1.0921 1.0909 1.0960 1.0965 1.0947 1.1015 1.1016 1.0995
irintensity: 0.0561 0.0531 0.2972 0.8847 0.9135 0.9089 1.5979 0.9072 1.0436 0.1866 4.7772 0.9503 2.4325 1.9204 3.0074 2.6608 0.1462 0.2369 3.6463 7.6155 4.6390 1.8383 12.7386 22.1232 5.8654 9.5986 0.6085 3.5443 5.4072 16.6541 3.6377 3.7617 93.2921 24.1153 18.6715 52.0093 74.2577 3.2391 10.9596 3.7892 0.0229 0.2199 2.2791 0.3650 16.4014 4.3385 3.5052 3.1172 0.0233 0.1441 0.0729 0.2278 2.0629 0.0987 1.7643 22.5031 3.7121 6.9361 13.3708 3.0289 23.6713 26.6628 0.8157 61.7030 0.9461 0.7258 0.2669 6.7285 1.9629 1.1135 24.2788 5.4007 12.6317 11.3853 9.1659 24.9900 116.5108 4.0510 15.5496 4.5289 0.1765 0.7325 5.3737 9.9618 9.2501 16.8461 46.2005 56.9295 11.3398 77.7456 2.2740 0.2146 47.8181 15.6857 5.4746 107.9902 204.4327 34.2342 4.9525 8.0886 9.3612 2.3963 1.0008 0.3573 0.1835 11.0586 23.7555 9.3027 37.2174 32.2467 26.2356 21.7873 24.0788 14.9900
temp: 298.150 k
press: 1.00000 atm
elementType: 8 7 6 6 6 6 6 6 6 6 6 6 6 6 6 6 6 6 6 6 6 6 6 1 1 1 1 1 1 1 1 1 1 1 1 1 1 1 1 1
symmnumber: 1
zpe: 835698.7 jmol-1
zpe.correction: 0.318301 hartree
zpe.thermalcorrener: 0.335757 hartree
zpe.thermalcorrenthalpy: 0.336701 hartree
zpe.thermalcorrgfe: 0.270641 hartree
zpe.sumelectzpe: -938.860160 hartree
zpe.sumelectthermal: -938.842704 hartree
zpe.sumelectthermalent: -938.841759 hartree
zpe.sumelectthermalfe: -938.907820 hartree
dipole: -1.2125 1.9233 -1.8856
dipole: 2.9538
quadrupole: -115.9733 -131.3924 -132.7521
quadrupole: -3.4208 -0.5341 7.5185
quadrupole: 10.7326 -4.6864 -6.0462 -3.4208 -0.5341 7.5185
hfenergy: -939.1784609 hartree
pointgroup: C01[X(C21H17N1O1)]
dipole: 0.3365518 -0.6986203 -0.8655373 debye
polarizability: 256.1118327|-37.5868753|219.1889961|-17.7058742|10.8955911|193.3924098 unknown
InChI: InChI=1S/C21H17NO/c23-21-20(17-11-5-2-6-12-17)18-13-7-8-14-19(18)22(21)15-16-9-3-1-4-10-16/h1-14,20H,15H2
charge 0 multiplicity 1
40 atoms
O  -0.440637 0.850841 2.594384
N  0.58133 -0.713562 1.143499
C  -1.795495 -0.508735 0.941043
C  -1.244831 -1.556412 -0.012913
C  0.165507 -1.634928 0.143918
C  -0.513733 -0.00922 1.679626
C  -2.577103 0.650786 0.31819
C  1.960355 -0.510764 1.608883
C  -1.892933 -2.38593 -0.9391
C  0.951263 -2.526158 -0.610107
C  2.871629 0.152188 0.577215
C  -1.120375 -3.298493 -1.70569
C  -3.518234 1.360242 1.105112
C  -2.341872 1.06926 -1.015841
C  0.283249 -3.362491 -1.539676
C  4.161977 -0.370534 0.320715
C  2.452573 1.32163 -0.105871
C  -4.218014 2.463334 0.568475
C  -3.041648 2.172449 -1.553371
C  -3.982912 2.873112 -0.764309
C  5.025949 0.265256 -0.600738
C  3.311607 1.955358 -1.029232
C  4.601782 1.429887 -1.279629
H  -2.433546 -0.978801 1.715836
H  2.386464 -1.481779 1.926443
H  1.870826 0.130907 2.506715
H  -2.978466 -2.325526 -1.073911
H  2.039102 -2.565211 -0.501727
H  -1.61256 -3.953616 -2.432125
H  -3.692387 1.055361 2.143564
H  -1.619709 0.526341 -1.63617
H  0.868414 -4.065767 -2.142718
H  4.495997 -1.274934 0.845871
H  1.456929 1.736398 0.091173
H  -4.943339 3.001874 1.188572
H  -2.852994 2.484302 -2.586996
H  -4.526953 3.727247 -1.182899
H  6.023025 -0.148114 -0.79005
H  2.978619 2.859979 -1.550326
H  5.268143 1.923423 -1.995834
