program: Gaussian 09
title: 000222702
version: EM64L-G09RevD.01
frameworkgroup: C1[X(C9H9N3O2)]
method: RPBEPBE
basis: SDD
operation: Freq
keyword: #pfreq=noraman
keyword: PBEPBE/SDD
title: #p freq=noraman PBEPBE/SDD
converged: YES YES NO NO
title: Mulliken charges:
elementType: O O N N N C C C C C C C C C H H H H H H H H H
charge: -0.206854 -0.221309 -0.433569 -0.397127 0.001722 0.049495 0.483393 0.182196 -0.685973 0.166387 -0.299277 -0.352041 -0.347526 -0.332388 0.331874 0.231267 0.238914 0.247082 0.355471 0.252284 0.248714 0.243372 0.243891
chargesum: 0.00000
title: Mulliken charges with hydrogens summed into heavy atoms:
elementType: O O N N N C C C C C C C C C
charge: -0.206854 -0.221309 -0.101695 -0.041656 0.001722 0.049495 0.483393 0.182196 0.031291 0.166387 -0.046993 -0.103327 -0.104154 -0.088496
polarizability: 1.44894762e+02 -1.06252691e+01 1.23699747e+02 1.29574294e+00 -1.50484532e+00 7.79350189e+01
1716.lowfreq: -8.4502 -4.1333 -0.0006 -0.0005 0.0002 3.7553 29.5866 58.6456 98.1356
frequency: 29.4128 58.6281 98.1354 161.6406 185.7409 205.7201 228.9981 261.9603 323.9269 336.8214 368.1159 381.2265 476.6380 491.1938 534.5376 598.0824 612.3765 641.6420 649.8214 661.3357 695.6970 722.8644 734.0385 754.3808 827.2222 857.9227 883.7629 945.7650 960.2655 969.1705 973.7586 977.5708 1058.8658 1074.7046 1083.4869 1099.0978 1148.9244 1207.8011 1223.2205 1239.5597 1298.2376 1309.5059 1318.2253 1328.9702 1354.0003 1389.9724 1400.6089 1460.6547 1469.2359 1470.5179 1554.1199 1579.2442 1685.1256 1727.1342 2998.3768 3100.2416 3114.2496 3133.3736 3138.7513 3163.4070 3171.6730 3586.6718 3601.2302
redmass: 3.9235 7.8486 6.8508 7.8409 3.9548 1.3888 2.0363 5.0623 5.5721 4.5064 2.4939 8.4939 2.2865 1.5340 3.9673 6.0824 5.3522 3.1911 1.4352 6.8594 7.8003 5.2978 5.5282 3.1338 1.6170 2.4994 1.2514 2.1474 3.4481 1.7137 2.6842 1.4864 2.7632 2.3441 1.7816 2.3797 2.9772 3.4674 1.4167 3.2100 6.3867 2.3435 3.4172 1.4924 1.6693 1.2260 1.8920 1.4374 1.2581 1.0839 7.4439 5.5323 8.6309 9.5589 1.0349 1.1017 1.1001 1.0884 1.0901 1.0952 1.0966 1.0803 1.0800
irintensity: 0.1865 0.2636 2.2967 2.9072 0.2460 0.3047 1.8277 7.7108 0.8985 0.8360 0.3369 9.0992 32.9209 95.7001 15.2822 7.6012 14.9075 34.1263 145.0991 0.8531 5.1696 21.5800 33.3509 1.8328 36.6149 25.9319 0.7341 9.2159 1.2262 0.5914 13.1338 0.4187 15.1972 5.0128 10.0303 10.8226 2.3810 35.0915 19.3422 83.9096 41.1820 120.1269 92.0244 4.0353 10.1732 10.5008 31.9958 3.4873 12.9784 9.9108 4.8580 51.8751 510.9859 411.1729 13.7894 18.4226 12.4813 15.7423 12.6082 15.2087 2.9869 81.2386 41.1273
temp: 298.150 k
press: 1.00000 atm
elementType: 8 8 7 7 7 6 6 6 6 6 6 6 6 6 1 1 1 1 1 1 1 1 1
symmnumber: 1
zpe: 455164.5 jmol-1
zpe.correction: 0.173363 hartree
zpe.thermalcorrener: 0.185283 hartree
zpe.thermalcorrenthalpy: 0.186227 hartree
zpe.thermalcorrgfe: 0.134525 hartree
zpe.sumelectzpe: -662.087779 hartree
zpe.sumelectthermal: -662.075859 hartree
zpe.sumelectthermalent: -662.074915 hartree
zpe.sumelectthermalfe: -662.126617 hartree
dipole: 0.6301 0.5648 2.7078
dipole: 2.8369
quadrupole: -99.6413 -84.3753 -77.0840
quadrupole: 3.9484 -1.9111 0.8420
quadrupole: -12.6078 2.6582 9.9496 3.9484 -1.9111 0.8420
hfenergy: -662.2611424 hartree
pointgroup: C01 [X(C9H9N3O2)]
dipole: -0.1923035 1.0318332 -0.3795757 debye
dipolederiv: -0.501165 -0.0565905 -0.0212429 -0.1192333 -0.3832374 -0.0420369 -0.0301124 -0.0829946 -1.0889132 -0.9102172 -0.3126246 -0.3222104 -0.3749095 -0.5552834 -0.1949341 -0.4730781 -0.2389141 -0.8353348 -1.0874422 -0.2619935 -0.037543 -0.2681197 -0.7092432 -0.0070169 0.0089071 -0.0279885 -0.3682976 -0.7071581 -0.1765563 -0.4059112 -0.2900033 -0.4631124 -0.2717025 -0.2316742 -0.1139514 -1.1901747 -0.387174 0.0217877 -0.0127848 0.0229158 -0.2787795 -0.033038 -0.0278862 -0.0437209 -0.3179341 0.1569633 -0.0943546 0.2619754 -0.063749 0.2273829 0.1405317 0.5458805 0.2326379 0.1323763 0.4308966 -0.1034821 -0.0422344 -0.1462077 -0.0392058 0.0744299 0.0571959 0.0299738 0.0188079 0.9256976 0.4270309 0.3442865 0.625878 0.4824899 0.28713 -0.0246299 0.1241079 1.3436968 -0.0510121 0.0187688 -0.0340617 -0.0178308 0.0010103 -0.0844771 -0.0828938 -0.0233835 0.0063651 1.4439479 0.6895167 0.282856 0.8261783 0.7661848 0.1252264 0.4274314 0.1474766 1.6469521 -0.3144095 -0.048619 -0.1874382 0.0541314 -0.0586247 0.0321679 -0.1223146 0.0415947 -0.0696231 -0.3153602 0.1487818 0.1580188 0.1000622 -0.1288195 -0.0241318 0.016844 0.0068636 -0.0737306 0.2462727 0.0153788 0.2279402 -0.064594 -0.0052327 0.0684259 0.0847334 0.1241516 0.2157589 0.231539 -0.1639927 -0.1362222 -0.0911493 0.0816877 0.1890682 0.019825 0.1353698 0.1730025 0.2684481 -0.0891753 0.0121319 -0.1381219 0.2687364 -0.0150616 -0.0173328 -0.0070404 0.1790158 0.0475706 -0.0618274 0.0919276 -0.046204 0.0240238 0.0375131 0.0848705 0.0709109 -0.0152498 -0.1202647 0.0891103 -0.0165053 0.0713657 0.0446816 0.0062108 -0.017578 0.0112112 0.1011647 0.0868284 -0.040968 -0.068492 -0.055384 0.0659563 -0.0034117 -0.0771419 -0.0592154 -0.0366695 0.2821595 -0.0712296 -0.0131696 -0.0760888 0.3155824 -0.0127097 -0.0645012 -0.0258003 0.1692883 0.1032539 0.0588013 0.0631509 0.0383094 0.0753342 -0.0623388 0.05118 -0.0770704 0.0494671 0.0933161 -0.0225838 -0.1009688 -0.0333213 0.1122928 -0.0458251 -0.0833344 -0.0569085 0.0082246 0.0267278 -0.018898 -0.0910268 -0.0061347 0.1033849 -0.0596181 -0.0852979 -0.0669584 -0.0328151 0.0505815 0.053719 0.0475243 0.0522105 0.0527908 -0.1044017 0.0409075 -0.1003517 -0.0153778 unknown
polarizability: 140.9338611|1.2416583|88.2228592|14.2754147|19.6342294|117.372808 unknown
InChI: InChI=1S/C9H9N3O2/c1-9(6-2-4-10-5-3-6)7(13)11-8(14)12-9/h2-5,11-12H,1H3
charge 0 multiplicity 1
23 atoms
O  -1.316927 0.138406 2.108172
O  -3.183919 -1.141467 -2.029327
N  -1.304701 0.21056 -1.462968
N  -2.450554 -0.737754 0.214318
N  3.551306 -0.727912 0.058968
C  -0.609435 0.681194 -0.250297
C  0.842901 0.176131 -0.151783
C  -1.475372 0.008231 0.873872
C  -0.688334 2.225041 -0.106013
C  -2.395435 -0.613833 -1.213771
C  1.644057 0.515724 0.967927
C  1.421644 -0.641385 -1.150871
C  2.973744 0.045742 1.027661
C  2.765189 -1.059531 -1.006402
H  -1.100181 0.541553 -2.404056
H  -0.085826 2.713458 -0.891902
H  -1.735171 2.56311 -0.192083
H  -0.301375 2.537055 0.877368
H  -3.166231 -1.297404 0.67895
H  1.240272 1.107807 1.794113
H  0.841639 -0.962714 -2.020984
H  3.612405 0.290292 1.883653
H  3.237205 -1.688603 -1.769643
