program: Gaussian 09
title: 000018855
version: EM64L-G09RevD.01
frameworkgroup: C1[X(C9H21N)]
method: RPBEPBE
basis: SDD
operation: Freq
keyword: #pfreq=noraman
keyword: PBEPBE/SDD
title: #p freq=noraman PBEPBE/SDD
converged: YES YES NO NO
title: Mulliken charges:
elementType: N C C C C C C C C C H H H H H H H H H H H H H H H H H H H H H
charge: -0.082898 -0.328402 -0.343543 -0.382944 -0.356367 -0.345404 -0.342679 -0.636103 -0.693450 -0.693753 0.164853 0.203706 0.169526 0.196567 0.208193 0.193469 0.207748 0.189341 0.190748 0.193474 0.191175 0.192382 0.230968 0.220743 0.182136 0.214806 0.208471 0.212045 0.214671 0.208689 0.211835
chargesum: 0.00000
title: Mulliken charges with hydrogens summed into heavy atoms:
elementType: N C C C C C C C C C
charge: -0.082898 0.040157 0.022550 0.018718 0.040722 0.038817 0.040878 -0.002257 -0.058129 -0.058559
polarizability: 1.27476953e+02 -3.34263628e-01 1.03558959e+02 5.23553632e-01 -2.98299760e-01 8.91483572e+01
1716.lowfreq: -0.4923 -0.0007 -0.0006 -0.0003 10.8310 22.5369 31.6918 51.0222 58.9933
frequency: 31.0635 50.8988 58.8076 78.4238 106.9928 118.9302 143.6947 148.8329 218.9088 226.7730 229.5984 258.8731 306.5989 330.2331 333.6592 423.8060 475.4085 509.3985 735.3413 736.7317 794.8667 798.5969 819.8826 897.3354 899.0690 929.8097 934.2491 992.4413 1024.5525 1052.4269 1070.4640 1080.0120 1089.0134 1103.2974 1105.0934 1115.9854 1149.7467 1187.3740 1211.2645 1228.3942 1238.6076 1270.2145 1273.0512 1283.2523 1286.3713 1296.4510 1303.2330 1344.0115 1345.2084 1372.6276 1374.4820 1389.3895 1390.1213 1431.0774 1459.6681 1466.0326 1468.5522 1469.8032 1472.4887 1476.1118 1476.9867 1477.0476 1480.8533 1483.3839 1489.1426 1490.3051 2809.7726 2822.4523 2846.0434 2963.0108 2963.4057 2972.1858 2972.3651 2977.7726 2978.8907 3002.2160 3005.4623 3007.0149 3023.5374 3028.7670 3045.2774 3048.9675 3069.6446 3069.8871 3071.3437 3071.5016 3085.7207
redmass: 1.7796 2.2007 1.7810 2.4922 2.4403 2.3980 2.3534 1.9434 1.3085 1.1384 1.1516 2.5474 2.2261 2.5222 3.0661 2.7252 2.6562 2.9355 1.0802 1.0757 1.1726 1.1702 4.6595 1.7006 1.7267 1.2371 1.1993 2.7691 3.3040 2.3946 2.3579 2.0257 2.1115 2.0652 1.4717 2.0123 1.8005 2.2763 1.7533 1.4089 1.5475 1.3441 1.3488 1.0909 1.0994 1.2170 1.2546 1.5070 1.5166 1.4035 1.4134 1.2212 1.2223 1.1655 1.0744 1.0777 1.0720 1.0617 1.0627 1.0472 1.0455 1.0567 1.0689 1.0545 1.0824 1.0912 1.0715 1.0685 1.0599 1.0585 1.0585 1.0371 1.0374 1.0607 1.0591 1.0863 1.0989 1.0985 1.0861 1.0729 1.1033 1.1008 1.1007 1.1007 1.0994 1.0995 1.0999
irintensity: 0.1045 0.0856 0.0136 0.3608 0.0423 0.7246 0.4359 0.5190 0.6139 0.0441 0.1199 0.2984 2.5540 2.2680 0.3680 4.2058 1.4125 4.6544 5.8721 11.3487 0.5167 0.2622 17.6569 13.2840 6.0711 5.5941 0.7172 14.2512 2.0053 22.7839 1.9456 3.9526 24.4205 2.9702 10.6911 1.0500 8.2972 11.4892 8.0246 2.3337 4.5596 2.2012 2.6227 0.9792 0.4143 15.2146 2.6120 2.1346 1.0020 16.2845 4.3889 8.4875 9.5654 3.4531 3.5389 0.7518 0.1281 5.0502 9.2919 6.5820 7.7541 15.4101 2.1149 4.1477 23.4253 15.8636 53.4366 86.5487 205.8612 24.8957 27.1138 46.1727 16.1736 42.3348 47.1391 32.8652 6.4667 3.1469 24.1503 29.7546 48.5866 40.4260 102.4569 88.0317 54.6156 61.2897 43.3969
temp: 298.150 k
press: 1.00000 atm
elementType: 7 6 6 6 6 6 6 6 6 6 1 1 1 1 1 1 1 1 1 1 1 1 1 1 1 1 1 1 1 1 1
symmnumber: 1
zpe: 748566.6 jmol-1
zpe.correction: 0.285114 hartree
zpe.thermalcorrener: 0.299098 hartree
zpe.thermalcorrenthalpy: 0.300043 hartree
zpe.thermalcorrgfe: 0.243302 hartree
zpe.sumelectzpe: -409.419907 hartree
zpe.sumelectthermal: -409.405923 hartree
zpe.sumelectthermalent: -409.404979 hartree
zpe.sumelectthermalfe: -409.461719 hartree
dipole: 0.0459 0.2025 0.7619
dipole: 0.7897
quadrupole: -65.4084 -64.7233 -67.7349
quadrupole: 0.2909 -0.3314 0.0522
quadrupole: 0.5471 1.2322 -1.7794 0.2909 -0.3314 0.0522
hfenergy: -409.7050213 hartree
pointgroup: C01 [X(C9H21N1)]
dipole: 0.0195987 0.0669996 0.3027553 debye
polarizability: 127.4797009|-0.3934874|103.5598319|0.3276714|0.3077241|89.144736 unknown
InChI: InChI=1S/C9H21N/c1-4-6-8-10(3)9-7-5-2/h4-9H2,1-3H3
charge 0 multiplicity 1
31 atoms
N  -0.016285 1.082881 -0.168785
C  -0.931689 0.109753 0.48148
C  1.387756 0.948426 0.304609
C  -2.31329 0.004895 -0.197853
C  2.099948 -0.322786 -0.204239
C  -3.161791 -1.152016 0.379185
C  3.592337 -0.356905 0.19945
C  -0.497399 2.475756 -0.037872
C  -4.563109 -1.241524 -0.263018
C  4.312808 -1.634949 -0.281696
H  -1.073829 0.353794 1.569863
H  -0.45393 -0.88638 0.439046
H  1.451148 0.98539 1.425524
H  1.947087 1.828114 -0.070649
H  -2.158668 -0.145401 -1.284442
H  -2.879009 0.950363 -0.080768
H  2.003547 -0.359839 -1.306853
H  1.604803 -1.232559 0.189772
H  -3.265441 -1.021209 1.476209
H  -2.623929 -2.110491 0.229203
H  3.676751 -0.27752 1.302959
H  4.104703 0.534797 -0.216588
H  -1.484234 2.587726 -0.517416
H  0.203871 3.1570 -0.551764
H  -0.591464 2.812842 1.027553
H  -5.149257 -2.079346 0.157476
H  -5.136078 -0.310003 -0.094744
H  -4.487942 -1.395002 -1.356014
H  5.378273 -1.635288 0.013645
H  3.84257 -2.540054 0.147148
H  4.266841 -1.724365 -1.383423
