program: Gaussian 09
title: 000222691
version: EM64L-G09RevD.01
frameworkgroup: C1[X(C8H17NO3)]
method: RPBEPBE
basis: SDD
operation: Freq
keyword: #p
keyword: freq=noraman
keyword: PBEPBE/SDD
title: #p freq=noraman PBEPBE/SDD
converged: NO YES NO NO
title: Mulliken charges:
elementType: O O O N C C C C C C C C H H H H H H H H H H H H H H H H H
charge: -0.461803 -0.338816 -0.284158 -0.617816 0.329507 -0.430188 -0.047589 -0.782371 -0.384331 -0.728903 -0.695404 0.300951 0.217279 0.195910 0.255390 0.231675 0.244246 0.213179 0.206320 0.235860 0.224110 0.241155 0.224326 0.337074 0.206755 0.213697 0.217414 0.334840 0.341691
chargesum: 0.00000
title: Mulliken charges with hydrogens summed into heavy atoms:
elementType: O O O N C C C C C C C C
charge: -0.124729 -0.338816 -0.284158 0.058715 0.329507 -0.016999 0.207801 -0.093271 0.057849 -0.039312 -0.057538 0.300951
polarizability: 1.09028633e+02 -5.56822005e+00 1.10057046e+02 -7.85677120e+00 -2.77532436e-01 9.23260763e+01
1716.lowfreq: -18.5321 -6.0358 -0.0009 -0.0002 0.0003 8.5616 29.4996 43.5742 62.9888
frequency: 27.9628 43.2863 62.6396 77.3677 96.1669 163.2958 190.8972 198.9977 216.3931 228.4714 259.9347 267.4725 292.4059 320.5447 345.0301 405.8728 411.4561 425.7465 474.7150 499.7352 515.4121 521.7317 587.0871 610.1972 697.9739 737.6897 745.4719 784.4615 848.0195 878.4511 899.4928 941.5073 954.8245 1003.7991 1017.2878 1046.4653 1053.5376 1056.9557 1095.4928 1119.6650 1133.7996 1162.1909 1206.1045 1241.8039 1278.2122 1285.5878 1289.2968 1325.6695 1334.4571 1344.0740 1365.1672 1386.5641 1389.1410 1391.5926 1459.2677 1463.7432 1468.7397 1473.8564 1474.5898 1477.0240 1485.5474 1491.5383 1588.2220 1683.5397 2970.4598 2973.5794 2983.3448 2996.3546 2998.2470 3018.6456 3037.9710 3043.3947 3072.1823 3073.9514 3092.3355 3094.7176 3105.3547 3105.8071 3534.7849 3557.9510 3715.4795
redmass: 3.9535 4.1844 2.3381 3.3287 2.7333 2.6533 2.0894 1.4946 1.6683 1.1821 3.0089 2.0848 2.7750 2.7402 2.2259 2.9005 2.0197 1.8385 2.3013 1.1953 1.0977 2.7268 4.1738 3.9734 10.7816 2.8098 1.1612 2.9913 1.5680 2.0590 1.5994 1.9165 5.3320 1.6976 1.6497 1.9145 2.1336 1.8782 2.1509 1.9383 2.1241 2.1083 2.1144 1.4616 1.4873 1.3924 1.2309 1.6093 1.9954 1.5666 1.5150 1.2522 1.2623 1.2393 1.0544 1.0630 1.0553 1.0526 1.0499 1.0433 1.0827 1.0556 1.2211 7.0157 1.0545 1.0411 1.0591 1.0361 1.0357 1.0987 1.0868 1.1006 1.1010 1.0998 1.0996 1.0989 1.0999 1.0999 1.0649 1.0446 1.1058
irintensity: 4.7027 0.4241 5.0421 1.8846 0.5472 1.3956 8.7874 1.6801 2.7645 0.2408 3.5784 0.8455 2.3868 1.7303 0.4049 50.5600 14.9989 28.7493 22.3984 365.8817 12.4490 5.9331 4.9381 1.0590 37.5247 5.2593 10.6945 6.9829 5.9587 29.8017 2.7762 7.0894 138.1485 38.0234 20.4816 61.8482 33.1043 0.9187 0.0106 46.7629 39.6044 15.3537 12.8701 6.0885 195.8630 6.7038 12.7099 73.9780 175.6009 11.5418 9.1915 16.1573 9.0288 36.6858 4.6876 6.6656 14.8915 11.4206 5.3629 13.4239 17.2015 1.9963 95.8951 341.7686 7.0725 41.4491 42.5153 12.7526 21.1466 4.3481 14.6767 7.5026 64.0201 56.4046 36.0846 22.2553 13.7383 24.4799 4.0003 65.4177 48.1413
temp: 298.150 k
press: 1.00000 atm
elementType: 8 8 8 7 6 6 6 6 6 6 6 6 1 1 1 1 1 1 1 1 1 1 1 1 1 1 1 1 1
symmnumber: 1
zpe: 650159.6 jmol-1
zpe.correction: 0.247633 hartree
zpe.thermalcorrener: 0.262648 hartree
zpe.thermalcorrenthalpy: 0.263592 hartree
zpe.thermalcorrgfe: 0.205386 hartree
zpe.sumelectzpe: -594.503634 hartree
zpe.sumelectthermal: -594.488618 hartree
zpe.sumelectthermalent: -594.487674 hartree
zpe.sumelectthermalfe: -594.545881 hartree
dipole: -1.9450 0.3578 1.1857
dipole: 2.3058
quadrupole: -63.9212 -78.0935 -74.9252
quadrupole: -0.2138 -10.8291 7.9251
quadrupole: 8.3921 -5.7802 -2.6119 -0.2138 -10.8291 7.9251
hfenergy: -594.7512664 hartree
pointgroup: C01 [X(C8H17N1O3)]
dipole: -0.6845958 -0.2275818 -0.5499964 debye
polarizability: 105.6570814|4.2873404|111.5546928|9.3649666|2.8151282|94.1999807 unknown
InChI: InChI=1S/C8H17NO3/c1-4-5-8(3,11)6(2)12-7(9)10/h6,11H,4-5,9H2,1-3H3
charge 0 multiplicity 1
29 atoms
O  0.723792 1.895825 -1.382082
O  -1.344457 0.23423 -0.487329
O  -1.539435 -1.732445 0.814822
N  -2.686029 -1.45051 -1.211224
C  0.936391 1.068619 -0.164306
C  1.572533 -0.283266 -0.594711
C  -0.440062 0.865423 0.539744
C  1.889379 1.90182 0.708224
C  2.007095 -1.23253 0.547274
C  -1.131807 2.152113 0.995253
C  2.652934 -2.525859 0.002664
C  -1.835407 -1.05564 -0.20125
H  2.451983 -0.032235 -1.220115
H  0.861851 -0.819883 -1.25652
H  -0.341838 0.146103 1.372627
H  2.891802 1.921355 0.247102
H  1.52797 2.940684 0.777387
H  1.980962 1.487036 1.727526
H  2.729117 -0.716202 1.209597
H  1.131722 -1.506391 1.167164
H  -0.5864 2.607433 1.840252
H  -1.172552 2.883371 0.170267
H  -2.15836 1.930743 1.334176
H  0.041945 1.427184 -1.931283
H  3.546163 -2.300558 -0.61041
H  1.939948 -3.085011 -0.631716
H  2.965859 -3.194675 0.825121
H  -2.901724 -0.823653 -1.982338
H  -3.125072 -2.364382 -1.146912
