program: Gaussian 09
title: 000222679
version: EM64L-G09RevD.01
frameworkgroup: C1[X(C13H25NO4)]
method: RPBEPBE
basis: SDD
operation: Freq
keyword: #p
keyword: freq=noraman
keyword: PBEPBE/SDD
title: #p freq=noraman PBEPBE/SDD
converged: YES YES NO NO
title: Mulliken charges:
elementType: O O O O N C C C C C C C C C C C C C H H H H H H H H H H H H H H H H H H H H H H H H H
charge: -0.303162 -0.271764 -0.307102 -0.318765 -0.146723 0.336389 -0.429228 -0.024578 -0.359814 -0.372427 -0.750791 -0.350538 -0.337242 -0.358341 -0.696029 0.354037 -0.612293 -0.620665 0.210538 0.223221 0.224066 0.231259 0.233748 0.198256 0.220443 0.217537 0.233977 0.236556 0.186594 0.191175 0.235001 0.241769 0.194473 0.198434 0.210599 0.215017 0.209288 0.226353 0.276856 0.224355 0.224292 0.224049 0.281181
chargesum: 0.00000
title: Mulliken charges with hydrogens summed into heavy atoms:
elementType: O O O O N C C C C C C C C C C C C C
charge: -0.303162 -0.271764 -0.307102 -0.318765 -0.146723 0.336389 0.004530 0.199488 0.105193 0.046273 -0.062721 0.027231 0.139527 0.034566 -0.061125 0.354037 0.115271 0.108857
polarizability: 2.11712642e+02 3.74764861e+00 1.49425310e+02 -5.20100684e+00 -4.29092982e+00 1.28043913e+02
1716.lowfreq: -19.2101 0.0009 0.0011 0.0011 3.0502 6.6227 14.0351 25.6118 42.2321
frequency: 9.7697 23.9119 41.8275 44.9998 52.9390 65.2659 85.2408 90.4387 110.4890 126.1136 129.2246 132.6780 160.3630 169.8912 198.3865 200.3241 214.8549 224.6240 237.4947 252.3807 292.3753 329.6208 342.6075 361.5869 383.5306 407.5554 425.3296 474.8270 500.8199 551.7190 575.8490 635.4400 645.5147 690.5279 727.7724 738.3072 747.7580 755.3318 777.0355 837.8058 856.1947 886.9141 896.8107 924.6640 929.1336 948.3721 980.5479 1002.1588 1011.5273 1025.8983 1043.8120 1058.4776 1059.1286 1067.2460 1086.4338 1099.1842 1108.9615 1122.4054 1124.1829 1146.0762 1149.3764 1180.2144 1189.9862 1207.3111 1231.9842 1237.5877 1243.2510 1248.8741 1274.5967 1279.4140 1288.0604 1298.8973 1307.8256 1317.5647 1345.6174 1346.5390 1353.5919 1369.3462 1384.5609 1386.8503 1390.0064 1420.6140 1434.7460 1449.0831 1450.7482 1459.6149 1462.1166 1465.8507 1469.8536 1472.6452 1474.8364 1476.4211 1477.5127 1481.4966 1487.1409 1488.5433 1500.2475 1649.1056 2951.7644 2965.4261 2965.4614 2971.3623 2971.5642 2973.0579 2986.2466 2988.3529 2991.9394 3003.2535 3015.8239 3019.9728 3030.3190 3035.6638 3037.8913 3042.1653 3053.7172 3067.8097 3070.8776 3103.8668 3113.2186 3117.4789 3121.7379 3123.6207 3147.9953
redmass: 4.6998 3.9735 2.1730 2.6898 2.6834 3.7014 1.1528 3.6916 2.4797 1.5628 1.7183 2.0158 1.7630 2.0565 2.2306 4.2337 3.2547 1.1446 2.7765 3.4693 3.7767 3.1936 2.8057 3.4220 2.7947 3.1362 2.0846 3.6312 3.4799 4.7937 4.8734 3.9418 4.7533 11.8975 1.1011 3.2922 2.0256 2.6693 2.3771 1.2955 2.9181 1.9885 2.1245 2.4459 3.9570 1.3158 3.9355 2.9682 3.4960 2.7205 1.5084 1.3751 2.8047 2.1240 1.9843 1.2199 2.0935 2.5582 2.6317 2.7277 1.3716 1.6311 1.4443 1.9051 1.8833 1.2275 1.3193 5.7431 1.1992 1.3269 1.0535 1.2913 1.3466 1.2885 1.3545 1.5086 1.6284 1.6736 1.3678 1.9584 1.2167 1.1630 1.1797 1.0680 1.1046 1.0648 1.0633 1.0630 1.0725 1.0482 1.0829 1.0425 1.0437 1.0737 1.0445 1.0901 1.2031 7.3678 1.0588 1.0375 1.0592 1.0373 1.0367 1.0595 1.0602 1.0848 1.0970 1.0358 1.1004 1.0643 1.1025 1.1009 1.0596 1.1018 1.1034 1.1007 1.0992 1.0996 1.1003 1.1040 1.1059 1.0972 1.0952
irintensity: 0.3099 2.6714 0.1572 0.2076 1.0573 1.5642 0.1721 0.2300 0.2967 0.8752 0.7994 0.7405 0.1861 2.9794 6.5705 3.6281 2.0871 0.1044 4.7701 1.8086 3.5884 5.7004 3.2647 26.8538 4.3817 1.7889 3.7845 6.5324 13.3132 8.5016 2.1701 4.6135 2.1733 19.0261 7.3710 13.9191 20.6037 5.7209 29.5690 5.9746 1.0946 10.6326 13.7666 23.9225 59.9587 0.2817 113.8971 2.1139 96.1359 33.1813 24.3762 9.0151 6.1479 16.1227 19.9772 0.0921 2.6725 40.1827 64.6609 400.4651 1.0845 35.1881 2.1450 38.5946 32.2642 0.2516 10.1257 24.0883 1.9468 4.8114 0.3038 6.7205 14.2022 16.6833 11.0530 2.5006 1.5914 34.8749 91.3036 48.0779 10.6434 32.3375 4.6355 5.4042 37.5233 2.4481 9.8043 2.5771 1.3672 21.0355 7.0334 12.2834 0.4698 4.2684 35.6536 21.7196 26.9974 421.8452 9.1977 32.5971 24.0425 142.2890 36.9112 36.0409 39.4277 38.4573 3.6506 11.7174 5.1393 31.0741 8.8778 45.5869 32.8402 27.9584 60.2900 102.2494 55.4826 17.5660 26.6478 17.3344 16.2087 2.5612 2.4657
temp: 298.150 k
press: 1.00000 atm
elementType: 8 8 8 8 7 6 6 6 6 6 6 6 6 6 6 6 6 6 1 1 1 1 1 1 1 1 1 1 1 1 1 1 1 1 1 1 1 1 1 1 1 1 1
symmnumber: 1
zpe: 970011.6 jmol-1
zpe.correction: 0.369458 hartree
zpe.thermalcorrener: 0.391394 hartree
zpe.thermalcorrenthalpy: 0.392338 hartree
zpe.thermalcorrgfe: 0.315207 hartree
zpe.sumelectzpe: -864.553533 hartree
zpe.sumelectthermal: -864.531597 hartree
zpe.sumelectthermalent: -864.530653 hartree
zpe.sumelectthermalfe: -864.607784 hartree
dipole: -3.0866 0.0854 -0.1231
dipole: 3.0903
quadrupole: -82.0028 -113.4011 -112.9092
quadrupole: 3.0672 -4.1321 -0.3993
quadrupole: 20.7682 -10.6300 -10.1382 3.0672 -4.1321 -0.3993
hfenergy: -864.9229911 hartree
pointgroup: C01 [X(C13H25N1O4)]
dipole: 1.2147998 -0.0492264 -0.0043819 debye
polarizability: 211.3918303|3.9148375|150.1253585|7.3464332|1.3103024|127.6646771 unknown
InChI: InChI=1S/C13H25NO4/c1-5-6-7-8-13(2)17-10-11(18-13)9-16-12(15)14(3)4/h11H,5-10H2,1-4H3
charge 0 multiplicity 1
43 atoms
O  -0.41905 -1.91782 -0.335964
O  -1.056215 -0.763514 1.632337
O  3.062928 -0.585383 -0.492998
O  2.45158 1.631848 0.011383
N  4.663759 0.885985 0.280534
C  -1.613184 -1.51107 0.4839
C  -2.49334 -0.608014 -0.403485
C  0.791335 -1.290233 0.2574
C  0.213864 -0.174414 1.157864
C  -3.781075 -0.10329 0.283607
C  -2.298445 -2.760529 1.031842
C  -4.546719 0.921297 -0.583098
C  1.665909 -0.841343 -0.922717
C  -5.842018 1.434386 0.08626
C  -6.604377 2.458546 -0.782001
C  3.335569 0.731028 -0.053803
C  5.123345 2.197793 0.761816
C  5.671591 -0.17985 0.171497
H  -1.879967 0.257321 -0.723865
H  -2.743979 -1.173978 -1.321965
H  1.334023 -2.047145 0.858607
H  0.048373 0.757697 0.587275
H  0.819523 0.044019 2.049129
H  -4.451591 -0.957071 0.508882
H  -3.51253 0.357482 1.254964
H  -2.756955 -3.338534 0.211345
H  -3.083064 -2.48197 1.755344
H  -1.555916 -3.39333 1.543985
H  -4.798171 0.464388 -1.563619
H  -3.883331 1.783743 -0.803746
H  1.248154 0.058853 -1.405636
H  1.753103 -1.663684 -1.64943
H  -6.503407 0.572148 0.309452
H  -5.588098 1.891743 1.06423
H  -5.974654 3.342785 -0.996182
H  -7.523652 2.812042 -0.2796
H  -6.898508 2.014773 -1.7521
H  5.886313 2.617175 0.077848
H  4.263335 2.882219 0.805222
H  5.568075 2.105601 1.771279
H  6.116078 -0.392317 1.163384
H  6.484262 0.130159 -0.514038
H  5.205328 -1.094638 -0.21574
