program: Gaussian 09
title: 000222659
version: EM64L-G09RevD.01
frameworkgroup: C1[X(C11H17N)]
method: RPBEPBE
basis: SDD
operation: Freq
keyword: #pfreq=noraman
keyword: PBEPBE/SDD
title: #p freq=noraman PBEPBE/SDD
converged: YES YES NO NO
title: Mulliken charges:
elementType: N C C C C C C C C C C C H H H H H H H H H H H H H H H H H
charge: -0.430203 -0.031148 -0.459846 -0.365292 -0.710411 -0.709732 0.460457 -0.371436 -0.430235 -0.219148 -0.194976 -0.278608 0.201577 0.207702 0.208734 0.224727 0.224348 0.212208 0.214053 0.214491 0.214380 0.214152 0.211651 0.291848 0.236225 0.210225 0.215197 0.216841 0.222222
chargesum: 0.00000
title: Mulliken charges with hydrogens summed into heavy atoms:
elementType: N C C C C C C C C C C C
charge: -0.138355 0.170428 -0.043411 0.083783 -0.069660 -0.069549 0.460457 -0.135210 -0.220010 -0.003950 0.021865 -0.056387
polarizability: 1.77178408e+02 -4.22650643e+00 1.22447195e+02 -1.44121966e-01 1.23150035e-01 7.95738118e+01
1716.lowfreq: -9.0501 -0.0003 -0.0001 0.0006 6.2552 14.3927 24.8512 41.6966 75.8457
frequency: 24.4270 41.4981 75.8299 108.2082 121.7575 204.8619 214.0147 229.4303 232.5313 272.1956 305.8213 356.0319 364.7159 410.4796 429.3648 506.6623 561.1866 583.9376 614.3695 691.0940 752.6887 779.9057 780.7796 815.7122 836.7632 867.0524 912.2353 952.5053 953.9600 966.3417 971.2985 976.0687 998.8197 1000.4960 1023.3073 1079.4579 1102.9920 1147.8385 1154.3878 1168.4000 1187.7847 1194.6197 1224.1760 1265.5464 1287.5062 1302.8592 1327.8262 1333.4232 1344.2228 1370.5932 1379.1896 1389.0659 1397.4468 1431.3050 1462.4710 1465.6757 1475.6436 1480.7622 1483.7039 1489.2287 1502.4156 1512.3731 1588.2392 1626.8893 2935.1349 2951.8666 2968.4779 2968.8875 2973.0880 2975.4097 3018.4974 3064.4197 3066.9639 3070.6364 3072.0836 3106.2109 3121.9371 3134.3638 3152.9958 3165.9446 3567.4832
redmass: 2.8401 3.7517 3.7966 2.3215 2.2529 3.7125 1.3110 1.9730 1.2367 3.2979 1.1138 2.0252 2.2585 2.9369 3.3625 2.6748 2.5566 5.9646 6.3386 1.8212 1.8109 1.4847 2.1767 1.2561 4.0359 1.5320 1.1814 1.3411 1.3329 2.0761 1.2908 5.7622 1.6908 1.9401 2.1717 1.7931 2.0319 2.6255 1.8624 1.0519 1.1152 1.8656 1.1618 1.4920 1.1053 1.7960 1.4437 1.4534 1.4367 1.8155 1.2158 2.6093 1.2251 2.4144 1.0801 1.0452 1.0542 1.7735 1.0665 1.0689 1.3627 1.8042 5.0833 6.2524 1.0567 1.0655 1.0686 1.0707 1.0672 1.0415 1.1038 1.0998 1.1000 1.0991 1.0986 1.0868 1.0859 1.0930 1.0933 1.1003 1.0769
irintensity: 0.2601 0.1517 0.0835 0.1131 13.0116 0.0469 0.0391 0.0409 0.0481 0.1043 79.6350 1.8900 0.2409 0.0750 2.3601 15.1722 8.4669 0.4352 0.6512 42.8797 86.0197 0.1392 0.1204 0.4690 6.6924 9.3475 2.4964 0.0021 0.1747 2.4458 0.5715 5.1411 0.1205 5.2386 9.5657 6.4350 13.0729 2.9451 2.8563 1.5545 10.8363 8.9039 0.9958 5.8254 0.0471 48.4821 28.1688 1.9635 5.9493 15.8195 22.5074 33.4603 15.0485 12.8027 11.2318 1.7047 2.5351 9.9266 19.1767 19.7549 139.0628 87.6331 10.9612 224.5385 42.8077 29.9658 1.4071 66.3445 58.5674 7.8459 65.0119 11.9581 18.4755 55.4247 121.3441 16.4582 3.3533 34.8152 46.3292 11.7364 28.3341
temp: 298.150 k
press: 1.00000 atm
elementType: 7 6 6 6 6 6 6 6 6 6 6 6 1 1 1 1 1 1 1 1 1 1 1 1 1 1 1 1 1
symmnumber: 1
zpe: 666480.2 jmol-1
zpe.correction: 0.253849 hartree
zpe.thermalcorrener: 0.266877 hartree
zpe.thermalcorrenthalpy: 0.267821 hartree
zpe.thermalcorrgfe: 0.213386 hartree
zpe.sumelectzpe: -483.194372 hartree
zpe.sumelectthermal: -483.181344 hartree
zpe.sumelectthermalent: -483.180400 hartree
zpe.sumelectthermalfe: -483.234836 hartree
dipole: 2.6416 -0.9678 -0.0092
dipole: 2.8133
quadrupole: -72.5429 -67.7601 -79.6381
quadrupole: 0.0202 -0.0306 0.0463
quadrupole: 0.7708 5.5536 -6.3244 0.0202 -0.0306 0.0463
hfenergy: -483.4482212 hartree
pointgroup: C01 [X(C11H17N1)]
dipole: 1.0434766 0.3686673 0.0193235 debye
polarizability: 177.2599172|3.5864524|122.3303356|0.9198633|1.1109422|79.6091615 unknown
InChI: InChI=1S/C11H17N/c1-10(2)8-9-12-11-6-4-3-5-7-11/h3-7,10,12H,8-9H2,1-2H3
charge 0 multiplicity 1
29 atoms
N  0.007209 0.875559 0.024862
C  3.829346 0.190465 0.032942
C  2.470823 0.94743 0.051051
C  1.216899 0.048776 0.014225
C  4.021048 -0.711682 1.276848
C  4.042652 -0.611142 -1.274607
C  -1.291525 0.367432 -0.00033
C  -1.547461 -1.036571 -0.039258
C  -2.407207 1.260583 0.012688
C  -2.874567 -1.516922 -0.064245
C  -3.72383 0.764798 -0.012517
C  -3.974558 -0.629552 -0.051349
H  4.614706 0.974839 0.070791
H  2.436508 1.635648 -0.819239
H  2.426892 1.576418 0.964736
H  1.217271 -0.635986 0.888782
H  1.234601 -0.588219 -0.895732
H  3.319045 -1.566279 1.271608
H  5.045622 -1.126777 1.30334
H  3.859571 -0.145668 2.213533
H  3.894987 0.026748 -2.166251
H  5.068349 -1.022058 -1.317145
H  3.34232 -1.464117 -1.347989
H  0.125799 1.887718 0.051687
H  -0.715226 -1.747369 -0.049799
H  -2.229594 2.343831 0.042683
H  -3.047479 -2.599467 -0.094111
H  -4.562249 1.47143 -0.001767
H  -5.000648 -1.010865 -0.070836
