program: Gaussian 09
title: 000222649
version: EM64L-G09RevD.01
frameworkgroup: C1[X(C10H8Cl3NO4)]
method: RPBEPBE
basis: SDD
operation: Freq
keyword: #p
keyword: freq=noraman
keyword: PBEPBE/SDD
title: #p freq=noraman PBEPBE/SDD
converged: YES YES NO NO
title: Mulliken charges:
elementType: Cl Cl Cl O O O O N C C C C C C C C C C H H H H H H H H
charge: -0.002101 0.006878 0.005452 -0.265012 -0.257638 -0.444708 -0.210385 -0.375993 0.549175 -0.446441 0.207623 -0.352883 -0.260597 -0.387471 -0.109684 -0.185775 -0.121220 0.187926 0.273206 0.251235 0.293926 0.392856 0.282440 0.284397 0.285696 0.399099
chargesum: 0.00000
title: Mulliken charges with hydrogens summed into heavy atoms:
elementType: Cl Cl Cl O O O O N C C C C C C C C C C
charge: -0.002101 0.006878 0.005452 -0.265012 -0.257638 -0.045610 -0.210385 0.016863 0.549175 0.078000 0.207623 -0.352883 0.033329 0.179365 -0.109684 0.099921 -0.121220 0.187926
polarizability: 1.65953265e+02 9.95446135e+00 1.74223293e+02 -2.72741459e+01 7.88137268e+00 1.25036556e+02
1716.lowfreq: -10.3102 -8.5192 -5.6472 -0.0014 -0.0010 0.0006 7.8152 17.2175 27.3690
frequency: 7.2668 17.1546 27.3029 42.2908 55.2087 59.4679 96.0530 133.0294 151.7240 172.5482 184.7389 199.5851 209.8009 247.4328 257.7876 298.8578 319.7246 352.1541 405.0403 434.4487 444.6219 464.7986 493.5870 496.3294 543.0427 563.8310 588.8381 606.1039 646.6967 650.6547 659.2224 687.1031 692.9630 697.3034 822.8966 838.5528 852.6991 862.5356 929.9255 979.1246 986.1672 1000.9404 1038.2184 1076.3725 1121.0017 1124.3172 1210.3751 1216.7692 1228.4407 1236.5456 1245.4780 1302.9343 1314.6867 1333.1889 1338.8244 1370.1242 1450.0469 1456.2975 1458.8291 1490.7595 1559.5273 1587.3864 1621.0400 1686.6862 2994.5118 3028.7059 3034.7563 3100.2606 3173.3481 3180.7502 3519.6180 3537.0821
redmass: 8.6040 12.6556 6.4414 6.8690 12.7271 10.2344 10.3284 8.9812 4.5802 8.9334 22.2462 4.2723 6.4906 8.3919 8.3467 6.5526 9.7621 11.8275 5.5824 5.9784 3.6444 7.3123 2.8124 3.5531 4.1780 3.8621 4.8310 10.0256 1.4686 6.3411 4.4579 3.2868 1.8234 2.1609 4.7963 1.5685 8.7810 1.3772 6.1871 2.0593 7.0346 2.1388 5.3704 2.0481 2.2628 3.4959 1.4787 1.1094 2.1640 1.7440 1.2908 2.4015 1.8783 1.6144 2.6176 10.1043 2.7010 1.1113 1.1102 2.2601 8.6973 8.3581 9.2608 9.4086 1.0607 1.0588 1.0991 1.1057 1.0921 1.0932 1.0778 1.0646
irintensity: 0.0381 0.3235 2.4994 6.0212 0.8608 2.3197 0.3652 0.2233 0.2953 0.5725 0.2833 9.4805 1.9194 10.0924 3.0281 3.6290 2.4095 4.2651 1.9897 12.4759 4.5367 28.0504 34.7381 13.9286 33.8892 1.0398 6.2841 1.0155 57.2650 96.3912 9.1901 3.1773 177.6215 22.3702 15.8865 11.2963 14.3532 37.5990 60.8587 5.8826 33.3768 5.1620 95.8499 205.6890 51.0854 16.6879 12.9883 0.1642 90.0363 41.9865 4.5027 40.7372 50.4491 3.4398 48.9921 6.8913 297.5749 22.2362 53.4503 238.1951 2.2825 21.8452 208.2697 263.0629 20.1340 17.1236 4.0213 5.2987 0.7116 1.1014 63.0797 42.4160
temp: 298.150 k
press: 1.00000 atm
elementType: 17 17 17 8 8 8 8 7 6 6 6 6 6 6 6 6 6 6 1 1 1 1 1 1 1 1
symmnumber: 1
zpe: 443912.9 jmol-1
zpe.correction: 0.169077 hartree
zpe.thermalcorrener: 0.187310 hartree
zpe.thermalcorrenthalpy: 0.188254 hartree
zpe.thermalcorrgfe: 0.117219 hartree
zpe.sumelectzpe: -2120.365215 hartree
zpe.sumelectthermal: -2120.346982 hartree
zpe.sumelectthermalent: -2120.346038 hartree
zpe.sumelectthermalfe: -2120.417074 hartree
dipole: 0.5253 2.9972 0.3116
dipole: 3.0588
quadrupole: -133.5634 -131.8091 -123.9955
quadrupole: 7.8543 -0.4470 2.9097
quadrupole: -3.7741 -2.0197 5.7938 7.8543 -0.4470 2.9097
hfenergy: -2120.5342923 hartree
pointgroup: C01 [X(C10H8Cl3N1O4)]
dipole: -0.2150352 0.2580225 -1.1556 debye
dipolederiv: -0.0861076 0.0819614 -0.1328177 0.0791687 -0.1434795 0.1895965 -0.1495893 0.2465826 -0.6091831 -0.0779593 0.0706294 -0.1189673 0.087626 -0.1270138 0.179893 -0.1835683 0.2325881 -0.5922506 -0.2825672 0.3367245 -0.0060522 0.3698997 -0.4922431 0.0081088 0.0038047 -0.0025369 -0.060343 -0.9842563 0.6101966 0.2474737 0.7801582 -1.1404989 -0.2578855 0.2211665 -0.1245555 -0.3371191 -0.6063385 0.0440982 0.1641306 -0.1764795 -0.492258 -0.1156109 -0.0450472 -0.4330146 -0.871534 -0.5685914 0.0390003 0.2540441 0.0522788 -0.3661675 -0.0515582 0.3688144 0.0093495 -1.0157754 -0.8879887 -0.2726657 0.1880639 -0.4394752 -0.5545246 0.0552946 0.0253127 -0.0708373 -0.527764 -0.8883472 -0.2338364 -0.1798712 -0.3409103 -0.694833 -0.223495 -0.1970162 -0.2555468 -0.5931754 0.7218795 -0.5834655 -0.2002771 -0.7845497 0.9378766 0.2648452 0.0817744 -0.0655262 -0.1770071 0.3627557 -0.2021584 -0.0777665 -0.3819999 0.4707379 0.2072192 -0.2921611 0.4059365 0.3327955 0.8895892 0.2723358 0.0070479 0.5702642 0.5773688 0.355921 0.1791239 0.5913187 1.0820881 -0.0941502 -0.0816667 0.2128387 -0.021577 -0.0160325 -0.3043709 0.2974543 -0.4554101 0.9137312 -0.2289087 0.0942698 0.0249428 0.113392 -0.2488554 -0.0437471 -0.2023658 0.1962372 -0.2060593 0.4803597 0.0016117 -0.0730205 0.0101781 0.17205 -0.1662297 -0.2649193 -0.2581555 -0.019058 0.0245249 -0.0755949 0.1570247 -0.1094708 0.0774614 -0.2428928 0.2523711 -0.3057848 0.9507614 -0.0799758 0.0765348 -0.0058358 0.0773769 -0.1355119 -0.0009161 -0.0336971 0.0737446 -0.1484032 0.3056008 -0.510261 -0.0454646 -0.5299009 0.63572 0.0712318 -0.0274751 0.0301828 -0.2097945 1.130958 0.4526519 -0.3580477 0.6025052 0.661304 0.1672859 -0.2925523 0.220881 1.26545 0.0449401 0.0751762 0.0188903 0.0551879 -0.0257169 0.005855 0.0437472 0.0484431 0.0536677 -0.0632093 -0.0191851 -0.0452233 0.0323849 0.1080211 0.0043432 -0.0161809 -0.1037296 -0.0176225 0.1559161 0.0486122 0.0255648 0.0414054 0.0894412 -0.0268181 0.0478096 -0.0342564 0.0329424 0.3895783 -0.0998098 0.0206476 0.0080979 0.2809284 -0.0040688 0.0807637 0.0183331 0.218857 -0.0694834 -0.0074931 0.0010304 0.0426092 0.0223083 -0.0314363 0.0643673 0.0088298 0.1134767 0.0347559 -0.0191379 -0.0607956 -0.0385987 0.0293069 0.0430823 0.0344498 0.0926098 0.0502656 0.1334879 0.0421975 0.0130937 0.0430464 0.1085018 -0.0212416 0.015912 -0.0219891 0.0425011 0.2435374 -0.1407258 -0.0306537 -0.1426176 0.2661086 -0.0624054 -0.0122988 -0.0436937 0.3285528 unknown
polarizability: 140.9116888|-35.7087373|149.7489615|2.7750627|-3.4283545|174.5524631 unknown
InChI: InChI=1S/C10H8Cl3NO4/c11-5-1-7(13)8(2-6(5)12)18-4-9(15)14-3-10(16)17/h1-2,14,16H,3-4H2
charge 0 multiplicity 1
26 atoms
Cl 1.00301 0.597131 -3.366427
Cl 2.580688 -1.704612 2.416016
Cl 3.668386 -3.18105 -0.323889
O  0.196862 1.741407 -0.757974
O  -1.619037 2.184271 2.403898
O  -3.443657 -0.587204 -1.16023
O  -5.073236 -1.219391 0.378493
N  -2.194822 1.059803 0.443976
C  0.989281 0.603043 -0.568829
C  -0.207581 2.510145 0.432113
C  -1.397468 1.890807 1.189858
C  1.455716 -0.050484 -1.739771
C  1.34567 0.075243 0.694963
C  -3.369006 0.421392 1.038557
C  2.159231 -1.07372 0.775614
C  2.264769 -1.194169 -1.657702
C  2.622334 -1.709661 -0.392958
C  -4.066229 -0.543614 0.095834
H  -0.505132 3.493399 0.031187
H  0.631872 2.653752 1.135113
H  0.992798 0.533891 1.621958
H  -1.966713 0.855882 -0.53413
H  -4.110946 1.176822 1.364438
H  -3.092295 -0.130418 1.95761
H  2.620404 -1.682561 -2.568319
H  -3.917201 -1.224205 -1.759098
