program: Gaussian 09
title: 000222646
version: EM64L-G09RevD.01
frameworkgroup: C1[X(C13H15Cl2NO4)]
method: RPBEPBE
basis: SDD
operation: Freq
keyword: #p
keyword: freq=noraman
keyword: PBEPBE/SDD
title: #p freq=noraman PBEPBE/SDD
converged: YES YES NO NO
title: Mulliken charges:
elementType: Cl Cl O O O O N C C C C C C C C C C C C C H H H H H H H H H H H H H H H
charge: -0.025151 -0.063263 -0.260287 -0.231439 -0.276747 -0.202676 -0.365229 -0.110245 0.261624 -0.695835 -0.335790 -0.438553 0.270102 -0.649702 0.513822 -0.296016 -0.303636 -0.207412 -0.253425 -0.106737 0.247108 0.209107 0.250613 0.243618 0.303441 0.224877 0.258968 0.273702 0.254165 0.204331 0.233997 0.226031 0.305586 0.279159 0.261896
chargesum: 0.00000
title: Mulliken charges with hydrogens summed into heavy atoms:
elementType: Cl Cl O O O O N C C C C C C C C C C C C C
charge: -0.025151 -0.063263 -0.260287 -0.231439 -0.276747 -0.202676 -0.061789 0.136863 0.261624 0.007502 0.148055 0.089314 0.270102 0.014657 0.513822 -0.296016 0.001950 0.071747 0.008471 -0.106737
polarizability: 2.16556330e+02 -4.60409090e+00 2.10782395e+02 -1.05504831e+01 -2.22027792e+00 1.14680151e+02
1716.lowfreq: -5.5647 -2.4205 0.0016 0.0023 0.0027 4.3251 7.4617 20.7448 25.2737
frequency: 5.9417 20.7301 25.2520 35.8870 43.1714 63.3500 87.0595 94.4794 113.8268 137.0908 151.0630 168.9213 180.4390 186.5957 217.3532 226.8021 239.0880 255.1379 286.3249 327.4649 335.9165 340.9550 360.5071 366.5503 387.0214 417.8245 444.8222 481.0031 542.8503 549.6649 565.1320 570.2002 618.0482 649.8466 680.2442 685.5020 705.1787 707.0023 772.0781 794.5519 821.2866 835.9267 859.4163 864.6737 885.9458 913.5314 948.9846 1002.6472 1009.8722 1026.0864 1043.9077 1054.7742 1084.8216 1087.7178 1093.3384 1116.0257 1137.2035 1143.1708 1160.7602 1216.7152 1220.0985 1247.5706 1270.2462 1278.1933 1287.5404 1318.4138 1347.2120 1355.1256 1362.0943 1386.6796 1390.8029 1396.4171 1444.5573 1460.5587 1466.1931 1467.7898 1471.8505 1476.5317 1480.9110 1503.7369 1573.2520 1593.2476 1625.9498 1671.0019 2984.1921 3000.1759 3003.3466 3006.0514 3007.0822 3070.2735 3086.9829 3089.4804 3099.7862 3099.9906 3111.0521 3138.8687 3178.2546 3181.3717 3536.1930
redmass: 4.8931 4.2595 3.2796 6.5044 6.6637 5.9364 4.0571 5.6700 9.9149 6.8016 5.8540 5.8062 3.0050 2.3693 1.0582 4.2764 4.3079 1.8484 3.6885 4.7369 6.0253 7.1852 6.9506 6.2080 9.9153 2.9079 3.4430 3.4152 3.8562 4.1968 1.2665 4.7647 7.6492 4.4279 6.6916 6.6197 4.1745 4.2788 1.3690 6.8127 1.4009 3.0654 1.3921 2.8913 2.5997 3.0469 1.3290 2.1887 4.7149 2.0785 5.1497 2.8788 2.4072 2.4822 2.1582 2.8287 2.6426 1.7438 1.3234 1.8206 1.9235 1.4759 1.4875 1.2613 1.4008 1.3140 1.4332 1.3116 4.6645 5.3403 1.2171 1.2143 1.0880 1.0496 2.4793 1.0747 1.0571 1.0560 1.0713 1.7664 7.1657 7.8656 7.4112 10.5786 1.0360 1.0377 1.0658 1.0738 1.0702 1.0984 1.0997 1.0975 1.1006 1.1008 1.1013 1.0918 1.0946 1.0937 1.0773
irintensity: 1.1009 0.2153 1.3487 1.6636 0.7705 7.5991 1.4389 6.2618 2.3684 0.5163 3.1934 0.1669 3.0424 3.8781 0.6360 1.8892 4.1823 0.3157 4.8398 18.5050 17.5303 3.1071 1.1593 2.9136 2.7152 2.5565 7.6830 0.7700 1.1441 6.1120 98.5930 2.4452 38.5900 6.3595 51.0552 15.7108 0.1475 2.4063 5.5842 28.2378 52.3008 11.2145 23.9484 11.0500 8.4834 1.5510 4.1299 21.4580 1.1887 20.2907 290.2115 8.2073 119.7800 19.2772 15.6930 180.9766 58.3524 7.0620 6.0886 37.4637 87.1319 23.3112 89.3821 24.4138 14.2828 5.7770 12.6963 1.8518 31.7929 4.5353 15.3660 17.1547 30.5901 23.0487 195.4389 35.2579 9.0438 8.2361 19.7392 156.7832 23.6012 1.0444 247.1614 144.2271 27.9797 14.6879 29.9350 29.2520 15.9654 12.5682 4.2024 29.2339 42.4232 7.8306 15.6555 26.0963 1.1518 0.1061 20.8286
temp: 298.150 k
press: 1.00000 atm
elementType: 17 17 8 8 8 8 7 6 6 6 6 6 6 6 6 6 6 6 6 6 1 1 1 1 1 1 1 1 1 1 1 1 1 1 1
symmnumber: 1
zpe: 686876.4 jmol-1
zpe.correction: 0.261617 hartree
zpe.thermalcorrener: 0.283017 hartree
zpe.thermalcorrenthalpy: 0.283961 hartree
zpe.thermalcorrgfe: 0.206309 hartree
zpe.sumelectzpe: -1778.644492 hartree
zpe.sumelectthermal: -1778.623093 hartree
zpe.sumelectthermalent: -1778.622148 hartree
zpe.sumelectthermalfe: -1778.699801 hartree
dipole: 8.5136 -0.1292 -0.1229
dipole: 8.5155
quadrupole: -107.4863 -128.5090 -133.4221
quadrupole: 1.1829 7.7704 6.8860
quadrupole: 15.6529 -5.3699 -10.2830 1.1829 7.7704 6.8860
hfenergy: -1778.9061094 hartree
pointgroup: C01 [X(C13H15Cl2N1O4)]
dipole: -3.3159462 0.1867754 -0.4402655 debye
polarizability: 212.5361199|-15.520491|186.2538815|17.6789507|40.4276892|143.2288746 unknown
InChI: InChI=1S/C13H15Cl2NO4/c1-3-16-13(18)8(2)20-12(17)7-19-11-5-4-9(14)6-10(11)15/h4-6,8,16H,3,7H2,1-2H3
charge 0 multiplicity 1
35 atoms
Cl 4.410948 1.352551 2.360654
Cl 4.300204 -2.84002 -1.281712
O  -1.816904 2.240703 0.386967
O  1.739273 1.993289 1.279587
O  -1.685339 -0.069553 -1.086731
O  -0.807547 0.78502 1.91466
N  -3.596514 -0.952909 -0.081745
C  -3.034065 1.39708 0.387643
C  -2.692904 0.056666 -0.328411
C  -4.106358 2.203742 -0.354278
C  -3.492241 -2.291581 -0.69632
C  0.507823 2.562137 0.761608
C  -0.732392 1.737835 1.118254
C  -4.633245 -2.578347 -1.693369
C  2.257029 0.857029 0.640239
C  3.544641 0.433043 1.05975
C  1.596278 0.127235 -0.378974
C  4.174011 -0.685651 0.486483
C  2.216229 -0.998015 -0.966546
C  3.493644 -1.386681 -0.528778
H  -3.322701 1.190916 1.43699
H  -5.06107 1.649546 -0.384206
H  -3.784526 2.404874 -1.389734
H  -4.27591 3.167103 0.155302
H  -4.358325 -0.785542 0.579341
H  -3.479084 -3.053122 0.106524
H  -2.514338 -2.321581 -1.204996
H  0.431453 3.55627 1.233099
H  0.541758 2.694956 -0.336544
H  -5.623749 -2.537128 -1.20299
H  -4.623224 -1.84624 -2.519352
H  -4.512815 -3.588421 -2.125025
H  0.584135 0.382739 -0.71051
H  5.166621 -0.994156 0.823344
H  1.695803 -1.560185 -1.746226
