program: Gaussian 09
title: 000222645
version: EM64L-G09RevD.01
frameworkgroup: C1[X(C16H14ClNO4)]
method: RPBEPBE
basis: SDD
operation: Freq
keyword: #p
keyword: freq=noraman
keyword: PBEPBE/SDD
title: #p freq=noraman PBEPBE/SDD
converged: YES YES NO NO
title: Mulliken charges:
elementType: Cl O O O O N C C C C C C C C C C C C C C C C H H H H H H H H H H H H H H
charge: -0.069449 -0.245001 -0.207356 -0.440234 -0.253846 -0.458141 0.339191 0.258194 0.496344 -0.464060 -0.363996 -0.318879 0.194637 -0.784291 -0.440040 -0.329404 0.264927 -0.246395 -0.107381 -0.335199 -0.324652 0.108571 0.214208 0.274975 0.232463 0.261827 0.307049 0.216922 0.238304 0.251890 0.226086 0.311384 0.253984 0.274146 0.277315 0.385905
chargesum: 0.00000
title: Mulliken charges with hydrogens summed into heavy atoms:
elementType: Cl O O O O N C C C C C C C C C C C C C C C C
charge: -0.069449 -0.245001 -0.207356 -0.054329 -0.253846 -0.151092 0.339191 0.258194 0.496344 0.025123 -0.102169 -0.086417 0.194637 -0.077175 -0.213954 -0.018019 0.264927 0.007589 -0.107381 -0.061053 -0.047336 0.108571
polarizability: 3.08658459e+02 2.01957895e+01 1.80986935e+02 -2.14113539e+01 1.16956196e+00 1.60452730e+02
1716.lowfreq: -6.1289 -4.3320 -0.7243 0.0007 0.0015 0.0024 9.6503 18.3843 27.7615
frequency: 9.4143 18.3514 27.7499 50.5847 64.3819 80.0025 88.2613 116.7173 131.1288 137.8275 162.5414 190.6423 194.0330 216.0687 246.7937 262.7513 300.4338 323.0671 336.9523 355.4703 375.9959 409.5571 412.3596 441.2103 486.5394 490.8374 499.2711 538.4493 547.3006 561.9597 589.8753 597.1820 621.0762 627.8485 649.8138 688.0527 709.2768 713.6840 729.4624 734.7609 763.1947 792.3880 825.4422 844.4768 856.1780 876.5948 884.9305 913.3610 918.2631 982.7582 991.4818 997.0803 999.2585 1011.4459 1021.6637 1030.9115 1047.9923 1090.3212 1124.5709 1127.1483 1147.6001 1151.8226 1180.1844 1196.0091 1226.3414 1253.5466 1265.5295 1270.3587 1306.5943 1324.7154 1342.5266 1373.3483 1380.1768 1393.3487 1402.2401 1422.2355 1447.8793 1457.5078 1469.8393 1479.5218 1495.2911 1507.0062 1589.3028 1590.8602 1602.4622 1621.8599 1639.6830 1649.0069 2945.2491 2987.0922 3059.8318 3066.5406 3098.1203 3117.3640 3151.0324 3159.3665 3165.3119 3174.2880 3175.4444 3202.3952 3505.2224 3534.9394
redmass: 9.6603 5.9932 3.9498 7.8528 10.2036 6.3080 6.8034 4.9499 1.1459 5.8529 5.6162 3.7219 5.4860 4.2066 3.5648 7.2733 4.8934 5.5588 6.2719 8.9953 5.2390 5.2002 2.9817 2.9140 5.9735 4.1513 2.9658 4.7254 3.4757 3.4349 1.2602 4.7887 7.3493 6.9599 1.1941 3.5817 4.1892 4.2642 5.5713 4.9225 4.4441 1.4651 5.8276 1.3991 6.0242 1.3450 1.5110 6.9907 1.3617 1.3689 1.9496 1.6417 4.4291 1.3381 3.2688 5.2005 1.5207 1.9199 1.4106 2.0558 2.4246 1.7283 2.1380 1.1869 2.1339 1.7573 1.5873 1.3139 1.4297 2.8868 1.3760 4.1794 6.2983 3.0263 1.2997 4.4845 1.0839 1.0451 1.7346 1.5217 2.0537 2.9643 5.2272 6.6712 7.4952 5.8178 8.5797 6.2785 1.0667 1.0366 1.0935 1.0969 1.1003 1.0901 1.0879 1.0926 1.0949 1.0910 1.0967 1.0957 1.0760 1.0642
irintensity: 0.0599 0.1118 0.1049 0.5437 6.4301 0.6492 1.8811 3.9399 1.6169 2.3900 0.6411 0.8876 2.2777 0.7604 4.5765 3.8069 0.3724 7.5162 3.1152 5.4741 1.9603 21.2739 0.8811 4.7948 10.2380 0.0203 61.3133 3.2263 4.2789 13.6702 60.9289 33.6331 38.5866 1.1842 55.3702 75.7537 6.5963 9.7359 6.8908 2.9552 21.7810 52.5733 3.3973 26.9991 33.5680 16.7732 53.8408 16.4503 1.1851 0.3165 2.7541 10.4016 155.2452 0.7279 211.0251 38.8552 7.3274 4.8303 36.1927 182.6212 18.7024 217.6543 102.7061 9.5763 30.5528 104.5915 12.6891 12.9010 76.4482 160.5221 17.6435 107.2758 4.2366 14.5197 19.5814 24.6150 14.5560 13.2757 44.6969 194.8788 233.7924 302.2446 21.4894 0.2482 7.3300 215.8928 376.3367 36.6564 54.3122 23.7241 10.8383 13.4727 22.1419 14.7354 18.9500 2.9134 3.0495 0.5583 4.9216 3.6117 12.7782 55.0568
temp: 298.150 k
press: 1.00000 atm
elementType: 17 8 8 8 8 7 6 6 6 6 6 6 6 6 6 6 6 6 6 6 6 6 1 1 1 1 1 1 1 1 1 1 1 1 1 1
symmnumber: 1
zpe: 702005.4 jmol-1
zpe.correction: 0.267380 hartree
zpe.thermalcorrener: 0.287889 hartree
zpe.thermalcorrenthalpy: 0.288833 hartree
zpe.thermalcorrgfe: 0.214246 hartree
zpe.sumelectzpe: -1432.255608 hartree
zpe.sumelectthermal: -1432.235098 hartree
zpe.sumelectthermalent: -1432.234154 hartree
zpe.sumelectthermalfe: -1432.308741 hartree
dipole: 0.6655 -2.9951 -2.7250
dipole: 4.1036
quadrupole: -154.1246 -133.6682 -127.2804
quadrupole: 9.0245 5.4125 8.7340
quadrupole: -15.7668 4.6895 11.0773 9.0245 5.4125 8.7340
hfenergy: -1432.5229873 hartree
pointgroup: C01 [X(C16H14Cl1N1O4)]
dipole: -0.1683162 0.9436478 1.2991312 debye
polarizability: 304.2297864|-35.4659026|165.3229337|15.7628521|-2.2458347|180.5454035 unknown
InChI: InChI=1S/C16H14ClNO4/c1-10-8-12(17)4-7-14(10)22-9-15(19)18-13-5-2-11(3-6-13)16(20)21/h2-8,18,20H,9H2,1H3
charge 0 multiplicity 1
36 atoms
Cl 5.712543 -0.011169 -3.418857
O  2.592032 -0.364081 1.727121
O  0.130388 -1.377973 0.711744
O  -6.385427 -0.959856 -1.891371
O  -6.911542 1.24667 -1.389695
N  -0.852619 0.748994 0.957852
C  4.442797 -1.015059 0.371284
C  3.253135 -0.238533 0.483591
C  -2.135774 0.569837 0.370724
C  1.366014 0.377323 1.934484
C  5.178414 -0.927975 -0.831391
C  2.810956 0.589212 -0.572149
C  0.171131 -0.190733 1.123429
C  4.882918 -1.908151 1.511236
C  -3.013808 1.690774 0.371921
C  -2.557967 -0.660283 -0.204839
C  -4.722108 0.36281 -0.768292
C  3.55902 0.664654 -1.770342
C  4.734248 -0.09461 -1.878128
C  -4.293174 1.587764 -0.192572
C  -3.844716 -0.751423 -0.766868
C  -6.083355 0.30264 -1.353666
H  1.512048 1.460213 1.728846
H  1.14987 0.252046 3.010378
H  1.884444 1.166399 -0.499659
H  6.094979 -1.514316 -0.947388
H  -0.670705 1.689191 1.321415
H  5.815053 -2.44145 1.26072
H  5.047585 -1.323547 2.434738
H  4.101679 -2.652756 1.749103
H  -2.690358 2.640502 0.817022
H  -1.880201 -1.514948 -0.207025
H  3.222929 1.297727 -2.59603
H  -4.9783 2.441394 -0.198971
H  -4.179537 -1.692016 -1.212673
H  -7.306193 -0.93397 -2.266097
