program: Gaussian 09
title: 000222643
version: EM64L-G09RevD.01
frameworkgroup: C1[X(C12H13Cl2NO4)]
method: RPBEPBE
basis: SDD
operation: Freq
keyword: #p
keyword: freq=noraman
keyword: PBEPBE/SDD
title: #p freq=noraman PBEPBE/SDD
converged: YES YES NO NO
title: Mulliken charges:
elementType: Cl Cl O O O O N C C C C C C C C C C C C H H H H H H H H H H H H H
charge: -0.018700 -0.046634 -0.279968 -0.263727 -0.440391 -0.214148 -0.389106 -0.146039 -0.105518 0.186610 -0.700337 -0.670391 0.523451 0.164619 -0.326413 -0.296401 -0.196819 -0.235183 -0.115193 0.245034 0.286146 0.384384 0.244288 0.229822 0.240818 0.244996 0.261470 0.220275 0.273183 0.282718 0.261163 0.395991
chargesum: 0.00000
title: Mulliken charges with hydrogens summed into heavy atoms:
elementType: Cl Cl O O O O N C C C C C C C C C C C C
charge: -0.018700 -0.046634 -0.279968 -0.263727 -0.044400 -0.214148 -0.004722 0.098995 0.180628 0.186610 0.014590 0.056350 0.523451 0.164619 -0.326413 -0.023218 0.085899 0.025980 -0.115193
polarizability: 1.85225586e+02 -2.68998343e+01 1.56795571e+02 9.76958846e+00 1.71461241e+01 1.58185613e+02
1716.lowfreq: -6.9365 -3.3389 -0.0026 -0.0021 -0.0015 4.3256 15.0626 21.4513 24.9644
frequency: 14.7341 21.0339 24.7650 42.4882 67.8282 76.2316 89.0041 111.0398 134.8850 165.4261 166.4000 201.6444 204.4751 214.9099 234.2387 245.6995 261.3786 294.9499 303.0639 336.7598 371.0521 405.0688 406.9229 440.4557 465.1612 489.6746 531.5765 548.2698 565.3887 610.5702 630.0951 635.1446 675.9075 694.0912 701.2129 703.0644 714.8108 790.8078 793.9296 806.1326 861.5188 881.2295 909.2222 926.0767 934.0910 1002.6895 1027.5069 1030.4876 1067.6802 1079.0251 1086.2387 1105.1309 1121.6539 1153.2706 1157.1391 1221.0709 1233.7830 1254.7294 1276.9795 1287.5328 1298.2493 1320.0019 1330.9655 1359.6556 1379.9484 1388.0370 1389.2120 1456.4611 1462.7324 1464.2787 1472.1802 1479.5932 1494.8445 1570.2873 1593.7891 1611.2790 1677.5955 3001.7075 3003.0444 3017.0290 3026.7565 3108.5526 3108.6281 3111.2193 3117.8136 3159.2676 3179.6088 3182.6638 3512.8515 3530.8404
redmass: 6.7603 5.7239 10.4892 8.7189 6.5127 5.2363 5.9239 4.5899 6.5437 8.1261 5.7497 1.3892 3.7217 2.8852 1.2308 3.1758 4.5866 4.1121 6.1077 7.8258 8.4770 4.7547 8.8237 3.3508 6.0419 4.3470 3.8343 4.1678 4.5555 1.3793 4.0203 7.2773 1.2987 5.2938 3.2320 4.2031 3.7784 3.7238 3.9258 1.4322 1.3882 3.8437 2.4694 3.0261 1.3386 1.9889 3.2800 2.5442 1.9841 2.0507 2.4224 1.9115 2.5455 1.3628 2.6040 3.5101 1.5561 1.3721 1.5613 1.3078 2.0781 1.2753 1.5054 4.9852 1.1968 5.1801 1.2147 1.8364 1.2117 1.1519 1.0601 1.0477 1.9493 7.6453 7.7075 8.6428 9.2008 1.0349 1.0349 1.0823 1.0857 1.1015 1.1005 1.1010 1.1015 1.0885 1.0960 1.0941 1.0778 1.0645
irintensity: 0.6528 0.9620 0.5783 3.0250 7.6398 0.0923 0.8043 0.4343 0.7944 0.7372 0.3528 2.8795 2.2850 3.3215 1.9920 1.9706 5.3995 1.9828 8.7190 2.4513 1.7880 6.9651 1.6576 5.2216 12.2717 19.4378 36.7928 5.3692 7.6916 115.7791 13.5457 22.7542 53.8904 41.6168 80.0967 5.7047 27.5476 22.3902 11.6835 54.7532 20.4616 34.3248 14.9970 28.3264 0.7455 132.4160 96.8651 26.8980 51.3136 23.8468 28.3914 74.5090 4.7548 6.9064 44.9948 176.7824 8.8993 45.8684 3.7128 20.2125 32.6548 3.0867 2.8019 19.0810 23.3311 3.6941 23.1699 196.0340 71.7617 71.9066 8.0534 16.9048 226.9356 19.9650 7.8104 159.7925 238.7584 11.1933 10.7092 11.1637 10.5579 17.8909 15.8994 18.7270 8.7495 3.0169 0.2897 1.0148 55.7661 38.0459
temp: 298.150 k
press: 1.00000 atm
elementType: 17 17 8 8 8 8 7 6 6 6 6 6 6 6 6 6 6 6 6 1 1 1 1 1 1 1 1 1 1 1 1 1
symmnumber: 1
zpe: 613782.6 jmol-1
zpe.correction: 0.233777 hartree
zpe.thermalcorrener: 0.253687 hartree
zpe.thermalcorrenthalpy: 0.254631 hartree
zpe.thermalcorrgfe: 0.181698 hartree
zpe.sumelectzpe: -1739.440144 hartree
zpe.sumelectthermal: -1739.420235 hartree
zpe.sumelectthermalent: -1739.419290 hartree
zpe.sumelectthermalfe: -1739.492223 hartree
dipole: -0.2087 0.9933 1.0382
dipole: 1.4519
quadrupole: -140.8515 -125.2702 -123.0968
quadrupole: -6.4633 -6.9822 -0.6528
quadrupole: -11.1120 4.4693 6.6427 -6.4633 -6.9822 -0.6528
hfenergy: -1739.6739212 hartree
pointgroup: C01 [X(C12H13Cl2N1O4)]
dipole: -0.030766 -0.5039801 0.2671402 debye
polarizability: 165.4015233|-5.3392307|168.2286334|-34.9194323|-10.9561536|166.5766133 unknown
InChI: InChI=1S/C12H13Cl2NO4/c1-6(12(17)18)15-11(16)7(2)19-10-4-3-8(13)5-9(10)14/h3-7,15,17H,1-2H3
charge 0 multiplicity 1
32 atoms
Cl 1.905934 -3.246273 0.579333
Cl 4.095821 0.04609 -3.319088
O  0.503862 -0.797592 1.462511
O  -1.844379 2.000486 1.426639
O  -3.232452 -2.303354 -0.30885
O  -5.122492 -1.190712 -1.082104
N  -2.015152 -0.15872 0.554358
C  -0.18538 0.336101 2.129887
C  -3.227933 0.128745 -0.224072
C  -1.415606 0.808887 1.3211
C  -0.594607 -0.175748 3.516184
C  -2.926705 0.924868 -1.526375
C  1.308744 -0.521336 0.349001
C  -3.984391 -1.148358 -0.575667
C  2.049211 -1.608692 -0.18523
C  1.430438 0.748948 -0.269428
C  2.895497 -1.449542 -1.295922
C  2.279065 0.927782 -1.384591
C  2.999923 -0.171826 -1.881699
H  0.503072 1.196818 2.225034
H  -3.898718 0.751995 0.398012
H  -1.614642 -1.101625 0.516813
H  0.300557 -0.450611 4.098132
H  -1.244269 -1.063184 3.428995
H  -1.142947 0.61665 4.05368
H  -3.864158 1.124868 -2.071948
H  -2.458807 1.884103 -1.25253
H  -2.239956 0.360484 -2.180667
H  0.861811 1.606571 0.100693
H  3.458347 -2.300163 -1.687702
H  2.368201 1.9106 -1.854971
H  -3.74329 -3.112759 -0.579425
