program: Gaussian 09
title: 000222642
version: EM64L-G09RevD.01
frameworkgroup: C1[X(C12H13ClN2O5)]
method: RPBEPBE
basis: SDD
operation: Freq
keyword: #p
keyword: freq=noraman
keyword: PBEPBE/SDD
title: #p freq=noraman PBEPBE/SDD
converged: YES YES NO NO
title: Mulliken charges:
elementType: Cl O O O O O N N C C C C C C C C C C C C H H H H H H H H H H H H H
charge: -0.052918 -0.320988 -0.409836 -0.233249 -0.214991 -0.256994 -0.412014 -0.607794 -0.121695 -0.524214 0.160623 0.168365 -0.392634 0.196053 0.418633 -0.319014 -0.367565 -0.206606 -0.181493 -0.120666 0.299894 0.282877 0.240384 0.356795 0.250370 0.256112 0.258851 0.252637 0.336512 0.355639 0.390988 0.257723 0.260215
chargesum: 0.00000
title: Mulliken charges with hydrogens summed into heavy atoms:
elementType: Cl O O O O O N N C C C C C C C C C C C C
charge: -0.052918 -0.320988 -0.018848 -0.233249 -0.214991 -0.256994 -0.055219 0.084357 0.178199 -0.000952 0.160623 0.168365 0.113848 0.196053 0.418633 -0.060163 -0.114928 0.051116 0.078722 -0.120666
polarizability: 2.36888076e+02 -1.57640704e+00 1.43866971e+02 -4.39692833e-01 -1.94967649e+01 1.28110536e+02
1716.lowfreq: -8.1648 0.0013 0.0016 0.0024 4.0827 5.1220 14.3992 21.7665 34.6903
frequency: 13.9618 21.6347 34.6732 40.4637 44.6733 56.8430 59.6033 83.0643 122.7672 128.4545 135.7600 153.8305 210.9965 235.4483 251.3588 289.5491 304.9052 319.1461 336.2450 414.3057 415.5463 432.2912 448.4129 493.4171 497.8656 504.8714 546.0464 580.3836 583.6055 597.1041 614.7958 623.6491 639.9582 666.4194 685.4141 687.7154 695.7790 735.8918 805.8117 808.0778 822.9232 836.1334 865.5516 904.9403 932.1325 952.5745 957.0353 992.2786 995.3577 1005.7025 1039.4426 1054.1927 1073.6016 1082.7883 1111.1225 1139.9091 1176.3196 1196.6226 1207.5617 1215.3003 1244.4718 1264.0193 1290.8950 1292.1502 1317.2992 1341.4693 1350.6616 1354.9355 1376.8686 1403.8865 1445.8240 1450.1706 1474.4697 1487.5258 1578.3450 1588.4673 1605.0747 1634.1843 1643.4206 1668.0813 2980.9128 2994.0458 3041.4542 3045.8049 3098.8619 3159.4850 3160.0464 3177.5058 3181.0826 3478.9178 3497.6117 3521.7034 3644.8214
redmass: 8.5421 5.2505 6.7528 6.8604 10.7346 9.4490 7.5710 4.9494 5.2452 7.4598 6.6442 2.6676 4.8247 5.0837 8.4831 7.0883 5.9903 7.2610 5.9253 5.7269 3.1231 7.8304 2.6364 2.6719 2.7376 3.9712 2.2582 1.6147 2.8007 1.2594 2.7917 6.7930 6.0359 1.7426 4.5529 3.4340 3.5752 1.1750 1.2800 6.5440 1.5536 4.4038 2.3141 5.1109 1.3372 1.3507 3.8822 4.0131 5.8493 1.9071 3.0811 2.4123 2.6175 2.0422 1.3042 2.8536 1.1891 1.3203 1.1148 3.8021 1.6431 1.6129 1.3878 1.4546 1.4372 1.4487 1.7545 2.8428 5.0310 3.5624 1.1640 1.1129 2.0217 1.9420 1.3881 7.4120 6.7104 7.7232 4.4791 9.2511 1.0557 1.0684 1.0830 1.1060 1.0931 1.0882 1.0884 1.0967 1.0977 1.0471 1.0764 1.0644 1.1034
irintensity: 0.2054 0.8233 4.0720 4.2881 1.0156 2.0381 2.8232 3.3856 2.2570 3.4697 3.1373 13.6823 4.8915 6.7029 0.6758 4.4099 1.0397 1.4596 2.2146 33.9607 2.5235 6.1128 4.9555 6.3221 23.7275 62.9389 6.0962 181.8314 5.0979 63.0467 48.4508 1.4527 45.2884 39.9421 22.3857 73.1842 0.1748 131.1809 9.1664 7.2945 85.4184 3.4203 7.0008 12.1531 0.0719 0.1604 46.5235 33.6966 69.2492 6.8003 182.7851 116.2350 45.0929 3.1502 15.8668 1.5473 57.0741 6.8544 5.2585 274.7836 12.6525 15.3158 28.9550 35.3847 19.9578 3.4177 86.6577 39.5065 7.6369 2.1274 187.6367 40.1669 258.4746 174.0908 114.2446 8.6347 20.5337 223.2242 323.3046 227.5386 20.3083 8.5619 4.6808 11.0616 1.6800 8.9884 1.0201 5.1638 0.9443 82.8288 69.5475 37.8450 86.7345
temp: 298.150 k
press: 1.00000 atm
elementType: 17 8 8 8 8 8 7 7 6 6 6 6 6 6 6 6 6 6 6 6 1 1 1 1 1 1 1 1 1 1 1 1 1
symmnumber: 1
zpe: 638068.4 jmol-1
zpe.correction: 0.243027 hartree
zpe.thermalcorrener: 0.263022 hartree
zpe.thermalcorrenthalpy: 0.263966 hartree
zpe.thermalcorrgfe: 0.189803 hartree
zpe.sumelectzpe: -1409.304583 hartree
zpe.sumelectthermal: -1409.284588 hartree
zpe.sumelectthermalent: -1409.283644 hartree
zpe.sumelectthermalfe: -1409.357808 hartree
dipole: 1.7976 -1.1492 -0.0191
dipole: 2.1336
quadrupole: -149.0732 -132.7682 -119.5005
quadrupole: 13.5102 10.5535 3.4558
quadrupole: -15.2925 1.0125 14.2801 13.5102 10.5535 3.4558
hfenergy: -1409.5476105 hartree
pointgroup: C01 [X(C12H13Cl1N2O5)]
dipole: 0.7521719 -0.1808639 0.3258182 debye
polarizability: 235.2966547|-5.8715458|118.9520454|-9.7398728|12.4982823|154.6168829 unknown
InChI: InChI=1S/C12H13ClN2O5/c13-7-1-3-8(4-2-7)20-6-11(17)15-9(12(18)19)5-10(14)16/h1-4,9,15,18H,5-6,14H2
charge 0 multiplicity 1
33 atoms
Cl 6.64889 -0.671834 -1.739425
O  0.925695 0.263826 -0.086087
O  -4.647278 -1.300706 1.756054
O  -1.447886 1.543152 2.342395
O  -2.42785 -1.998671 1.761667
O  -4.929782 1.238183 -2.535311
N  -1.650235 0.309099 0.363032
N  -2.989125 2.106119 -1.600705
C  -3.08725 0.06276 0.52421
C  -3.82078 -0.11389 -0.833091
C  -0.926514 0.949447 1.355446
C  -3.302036 -1.184394 1.405309
C  0.595017 0.910044 1.188258
C  -3.965474 1.136939 -1.72233
C  2.287718 0.080512 -0.401993
C  3.355062 0.494334 0.43021
C  2.544635 -0.558517 -1.63855
C  4.687984 0.262266 0.018259
C  3.872277 -0.788692 -2.04833
C  4.929852 -0.37428 -1.211467
H  -3.516796 0.918704 1.076376
H  -4.847133 -0.463605 -0.637739
H  -3.325717 -0.904838 -1.432332
H  -1.108865 -0.25403 -0.302495
H  0.984646 1.945818 1.222855
H  1.015766 0.339832 2.040043
H  3.177769 0.991116 1.388108
H  1.704491 -0.86957 -2.266229
H  -3.065836 2.942405 -2.179541
H  -2.195393 1.986231 -0.968695
H  -4.781886 -2.102796 2.329543
H  5.52139 0.576153 0.653113
H  4.079645 -1.282112 -3.001956
