program: Gaussian 09
title: 000222640
version: EM64L-G09RevD.01
frameworkgroup: C1[X(C19H25ClO3)]
method: RPBEPBE
basis: SDD
operation: Freq
keyword: #p
keyword: freq=noraman
keyword: PBEPBE/SDD
title: #p freq=noraman PBEPBE/SDD
converged: YES YES NO NO
title: Mulliken charges:
elementType: Cl O O O C C C C C C C C C C C C C C C C C C C H H H H H H H H H H H H H H H H H H H H H H H H H
charge: -0.067753 -0.239715 -0.242511 -0.263818 0.413108 -0.273820 -0.194774 -0.562675 0.034139 -0.446642 -0.530201 -0.810920 -0.787562 -0.482796 -0.340587 0.286940 -0.425077 0.347533 -0.322020 -0.356192 -0.210910 -0.184027 -0.116103 0.232075 0.235372 0.223925 0.227470 0.204578 0.211202 0.201678 0.211317 0.233897 0.234183 0.215050 0.211626 0.209296 0.210495 0.227873 0.220718 0.245792 0.226382 0.254762 0.258427 0.226596 0.285757 0.257497 0.254141 0.256277
chargesum: 0.00000
title: Mulliken charges with hydrogens summed into heavy atoms:
elementType: Cl O O O C C C C C C C C C C C C C C C C C C C
charge: -0.067753 -0.239715 -0.242511 -0.263818 0.413108 -0.041745 0.040598 -0.111281 0.238718 -0.033761 -0.084987 -0.150060 -0.139899 -0.016286 0.140556 0.286940 0.059946 0.347533 -0.036263 -0.098696 0.043231 0.072250 -0.116103
polarizability: 2.50193502e+02 3.71661810e+01 2.09190945e+02 -3.26246982e+00 -7.36450984e+00 1.93177882e+02
1716.lowfreq: -19.1175 -4.4962 -1.5698 -0.0017 -0.0009 0.0006 8.7761 13.7631 26.9871
frequency: -12.8610 13.3526 25.7710 27.3377 53.6878 60.0169 78.5932 108.9811 120.4197 139.0365 163.4189 169.6164 198.9339 202.1205 217.9310 239.0968 250.7184 272.1424 296.0676 309.6013 322.8836 334.4929 360.7024 370.1606 391.0116 411.1875 415.7112 426.4336 444.6674 475.2731 500.7089 508.7010 529.0818 569.1280 590.5624 615.4146 626.6437 659.2064 695.1263 721.8206 764.0611 768.4994 777.3142 796.2420 811.3053 814.0082 825.1013 837.7538 858.2003 881.4670 902.6664 927.6733 936.8934 937.3240 943.3337 951.7895 952.5580 966.1410 975.4368 989.8195 992.3642 1000.0665 1017.8411 1029.6871 1048.6592 1068.3733 1071.1200 1076.7829 1084.6699 1108.9722 1110.6641 1147.0050 1159.7447 1169.1559 1177.7398 1199.9336 1202.7701 1205.2360 1213.9324 1215.4036 1234.3599 1238.2809 1257.9823 1261.5055 1280.1706 1283.3697 1291.9275 1293.4045 1300.1104 1319.3820 1326.0967 1340.5841 1353.7399 1359.8724 1371.5605 1372.7817 1377.7407 1394.6305 1403.2010 1451.4500 1453.9136 1460.8675 1464.8247 1469.2239 1472.6907 1473.1530 1480.8261 1481.5354 1492.7710 1500.8893 1587.3456 1600.6474 1627.1517 2957.1632 2966.0067 2970.3041 2975.6294 2986.4778 2989.5442 3003.6338 3017.6732 3018.9338 3023.1206 3031.1249 3033.3728 3044.0417 3048.0566 3049.1593 3055.2866 3074.9928 3080.1741 3095.3356 3108.4700 3121.1855 3155.7542 3159.6087 3173.3266 3179.8810
redmass: 4.7544 4.4764 5.6173 4.3959 8.9242 4.6429 4.4338 4.1245 3.6893 3.1712 4.7033 1.2873 4.4118 1.7459 1.9479 2.4100 2.9435 3.8985 3.7013 1.8003 5.8573 3.9736 6.3380 2.6227 2.4848 2.1834 2.8694 2.8957 3.1028 3.5405 2.8044 2.9563 3.6485 3.3745 5.9588 5.1629 5.8393 2.6956 3.7089 5.1354 3.7117 1.9159 1.9351 2.7363 1.3476 1.9861 1.5771 2.4006 2.4260 2.2678 2.5136 3.9982 1.3476 1.5369 1.7459 1.3548 1.9320 1.8531 7.3151 1.3858 3.8528 2.2591 1.5763 1.8987 1.9854 2.8712 2.5195 1.7951 1.3594 1.3410 1.5722 2.0556 1.9094 2.4288 1.2841 1.5705 1.5243 1.6531 2.9016 2.3573 1.4228 1.6901 1.6390 1.2823 1.2955 1.5089 1.3118 1.2841 1.7014 1.3682 1.2565 1.3803 1.3934 1.2616 1.3781 6.3853 1.2223 1.2025 3.4810 1.0872 1.0953 1.0663 1.0690 1.0749 1.8421 1.2225 1.0686 1.0699 1.0705 1.0669 7.1673 6.6865 8.8646 1.0823 1.0371 1.0379 1.0598 1.0594 1.0629 1.0850 1.0814 1.0622 1.0945 1.0596 1.0755 1.1023 1.0991 1.1013 1.0980 1.0982 1.0966 1.1038 1.1093 1.1025 1.0890 1.0884 1.0969 1.0979
irintensity: 0.0693 0.0514 0.2875 0.3776 1.4452 0.1886 0.3997 0.7465 0.4513 0.4526 1.4080 0.3258 1.0681 0.6365 0.2563 0.3786 0.7208 5.5311 8.5124 0.0494 15.7651 0.9397 7.8608 1.7513 0.8001 0.6859 1.4462 6.6610 0.5368 0.0881 23.2310 13.8515 0.7415 2.8590 37.3765 18.1137 7.2706 0.7306 0.5525 11.0539 4.0533 0.2241 1.5107 12.3769 2.0593 4.4017 91.9978 4.1510 2.0538 2.4452 13.0953 42.9557 1.0680 1.6362 2.1746 0.5895 3.1642 7.9009 82.4882 0.0678 38.2640 90.7342 3.6291 2.5837 0.3780 14.7070 34.5994 1.9850 1.7251 24.9566 0.4604 19.4321 3.6862 294.0742 56.1164 5.2028 5.8587 17.0863 32.9036 8.0581 2.0474 5.1212 0.6598 127.6940 1.7415 2.5108 0.1591 4.1876 4.4176 2.6841 1.6376 1.1455 2.2087 4.0940 0.9082 9.1156 16.4539 19.6830 0.7550 15.7360 7.5971 1.1156 2.6883 13.7841 161.1022 52.1152 1.7973 21.2888 16.9038 6.7028 10.3070 11.1687 148.2550 18.2973 29.6766 54.6649 31.8410 10.3832 54.9349 47.5699 65.6645 31.0445 14.4687 32.8278 22.1451 22.4567 5.2372 63.3646 71.8327 36.2897 49.1558 43.8692 17.8019 6.8485 2.3894 2.4673 3.0968 3.0777
temp: 298.150 k
press: 1.00000 atm
elementType: 17 8 8 8 6 6 6 6 6 6 6 6 6 6 6 6 6 6 6 6 6 6 6 1 1 1 1 1 1 1 1 1 1 1 1 1 1 1 1 1 1 1 1 1 1 1 1 1
symmnumber: 1
zpe: 1048106.5 jmol-1
zpe.correction: 0.399203 hartree
zpe.thermalcorrener: 0.421140 hartree
zpe.thermalcorrenthalpy: 0.422084 hartree
zpe.thermalcorrgfe: 0.346001 hartree
zpe.sumelectzpe: -1422.960833 hartree
zpe.sumelectthermal: -1422.938896 hartree
zpe.sumelectthermalent: -1422.937952 hartree
zpe.sumelectthermalfe: -1423.014034 hartree
dipole: 3.3849 2.4368 -0.3637
dipole: 4.1867
quadrupole: -151.8247 -142.0903 -143.3558
quadrupole: -7.1017 3.1816 2.9755
quadrupole: -6.0678 3.6667 2.4012 -7.1017 3.1816 2.9755
hfenergy: -1423.3600355 hartree
pointgroup: C01 [X(C19H25Cl1O3)]
dipole: 1.1627801 -0.5880224 -1.0076194 debye
polarizability: 237.4328073|-18.3354591|203.2757405|-37.6418319|15.5589377|211.8537808 unknown
InChI: InChI=1S/C19H25ClO3/c1-19(2)14-4-3-13(17(19)11-14)9-10-22-18(21)12-23-16-7-5-15(20)6-8-16/h5-8,13-14,17H,3-4,9-12H2,1-2H3
charge 0 multiplicity 1
48 atoms
Cl -5.808505 1.90527 3.337485
O  -0.152737 -1.345801 -2.29356
O  -0.963538 0.773905 -1.743099
O  -2.884104 -1.601047 -0.608161
C  5.473378 -0.285712 0.613158
C  3.937737 -0.685423 0.580509
C  4.945585 1.186992 0.878712
C  3.659872 0.547294 1.517286
C  3.32143 -0.430601 -0.821193
C  4.556139 1.876408 -0.44948
C  3.419382 1.093764 -1.189543
C  6.345617 -0.552338 -0.627575
C  6.191668 -0.874809 1.849361
C  1.850823 -0.926675 -0.870359
C  1.253724 -0.819557 -2.278968
C  -1.155084 -0.444377 -1.976249
C  -2.517356 -1.147427 -1.958421
C  -3.539302 -0.699483 0.261491
C  -3.601043 0.702389 0.075929
C  -4.150975 -1.307893 1.384813
C  -4.300775 1.493917 1.016805
C  -4.840675 -0.516742 2.324673
C  -4.911238 0.877185 2.122911
H  3.6803 -1.693896 0.954983
H  5.57888 1.836188 1.509839
H  2.707301 1.087282 1.381865
H  3.779003 0.309189 2.586131
H  3.900657 -1.027342 -1.557355
H  4.202611 2.905117 -0.241161
H  5.452394 1.977916 -1.090736
H  3.530059 1.219403 -2.283556
H  2.451098 1.562922 -0.927848
H  5.918382 -0.147002 -1.560211
H  7.346757 -0.097717 -0.497159
H  6.49293 -1.64051 -0.771689
H  6.346757 -1.964202 1.726142
H  7.186451 -0.40658 1.97928
H  5.625893 -0.721779 2.784821
H  1.804052 -1.98351 -0.543708
H  1.236212 -0.333206 -0.166083
H  1.779615 -1.467849 -2.999016
H  1.233288 0.223183 -2.639454
H  -2.464738 -2.069035 -2.556202
H  -3.28568 -0.462956 -2.363125
H  -3.074888 1.189577 -0.749932
H  -4.085198 -2.393309 1.502797
H  -4.351779 2.578946 0.888385
H  -5.319684 -0.978168 3.192769
