program: Gaussian 09
title: 000222629
version: EM64L-G09RevD.01
frameworkgroup: C1[X(C6H5IN2O2)]
method: RPBEPBE
basis: SDD
operation: Freq
keyword: #p
keyword: freq=noraman
keyword: PBEPBE/SDD
title: #p freq=noraman PBEPBE/SDD
converged: NO YES NO NO
title: Mulliken charges:
elementType: I O O N N C C C C C C H H H H H
charge: 0.119961 -0.223766 -0.222212 0.018793 -0.665341 0.398681 0.680587 -0.326075 -0.358314 -0.541465 -0.347144 0.302088 0.288036 0.235487 0.319204 0.321481
chargesum: 0.00000
title: Mulliken charges with hydrogens summed into heavy atoms:
elementType: I O O N N C C C C C C
charge: 0.119961 -0.223766 -0.222212 0.018793 -0.024656 0.398681 0.680587 -0.023987 -0.070279 -0.541465 -0.111657
polarizability: 1.90420621e+02 -1.13314785e+01 1.32673743e+02 -1.83628507e-02 1.32992369e-02 3.68638940e+01
1716.lowfreq: -10.5026 -6.0589 -0.0004 -0.0001 0.0004 7.4914 59.0875 105.8595 126.2666
frequency: 59.0797 105.8579 126.2625 146.0672 214.8055 255.9995 301.0211 352.3680 429.5537 432.1375 453.5274 501.0737 527.1869 535.6128 622.4522 657.1446 681.7581 732.5580 769.2801 828.5492 846.0671 931.2309 977.6824 1005.3311 1030.9957 1101.6213 1150.5863 1216.5320 1266.8643 1328.3232 1352.0050 1397.5879 1435.4824 1493.5408 1565.1799 1608.7573 1642.0913 3140.8732 3183.8394 3187.2036 3524.6665 3678.8188
redmass: 14.1133 5.3896 14.9471 5.0488 7.5386 7.9170 5.7281 9.3466 3.6016 1.9755 1.3116 1.3933 5.5810 2.8628 8.3613 8.4923 6.1293 3.9576 8.4106 1.6205 6.5307 1.3941 1.3427 2.9583 1.5458 2.8594 1.2079 5.8631 1.5017 2.4284 6.8991 5.8989 6.4378 3.6280 7.9169 3.4733 1.4386 1.0903 1.0925 1.0952 1.0477 1.1016
irintensity: 0.1551 0.0047 2.1116 0.2607 2.0778 0.4787 13.7246 0.2397 1.6464 43.3363 1.5446 210.8194 3.5894 35.7893 11.1281 42.7945 10.2367 9.6548 5.0405 53.4829 6.1615 19.9467 0.7513 16.3608 21.8562 40.5183 52.9581 603.7431 42.1173 37.8236 68.7346 57.6958 15.8438 44.6724 0.2548 62.9844 371.2594 10.3760 3.3419 4.4228 122.0319 52.0360
temp: 298.150 k
press: 1.00000 atm
elementType: 53 8 8 7 7 6 6 6 6 6 6 1 1 1 1 1
symmnumber: 1
zpe: 279911.7 jmol-1
zpe.correction: 0.106613 hartree
zpe.thermalcorrener: 0.116565 hartree
zpe.thermalcorrenthalpy: 0.117509 hartree
zpe.thermalcorrgfe: 0.069240 hartree
zpe.sumelectzpe: -502.230159 hartree
zpe.sumelectthermal: -502.220206 hartree
zpe.sumelectthermalent: -502.219262 hartree
zpe.sumelectthermalfe: -502.267532 hartree
dipole: -5.5222 5.6708 0.0020
dipole: 7.9153
quadrupole: -94.5785 -66.1987 -80.7410
quadrupole: 6.4269 0.0043 0.0006
quadrupole: -14.0724 14.3073 -0.2349 6.4269 0.0043 0.0006
hfenergy: -502.3367713 hartree
pointgroup: C01 [X(C6H5I1N2O2)]
dipole: -2.8956964 -1.1457507 -0.0007801 debye
dipolederiv: -0.2230889 0.1976792 -0.0000245 0.2222572 -0.2747246 0.0000179 0.0000855 -0.0001055 0.0256899 -1.0225577 0.2216459 -0.0000567 0.3954088 -0.5713245 -0.000061 -0.000272 0.0000854 -0.2449488 -0.716358 -0.1725189 -0.0000949 -0.4807622 -0.7829568 -0.0000764 -0.0002749 -0.0002095 -0.2431546 2.2999799 0.1100668 0.0003461 0.3292498 1.0496249 0.0002007 0.0005878 0.0001501 0.1938361 -1.5712605 -0.4064968 -0.0001084 -0.3595905 -0.2705152 -0.000018 0.0000393 -0.0000007 -0.661747 -1.1795277 -0.1123261 -0.0002181 -0.2527835 -0.158278 -0.0000654 0.0000052 -0.0002387 0.0068936 1.3830543 0.7247365 0.0001351 0.4746461 0.0114478 0.0000484 0.0001305 0.0000527 0.1927916 0.4039538 0.0897026 0.000062 0.0340024 -0.1811609 -0.0000079 -0.0000083 0.0001176 -0.0107106 0.3504552 0.203753 0.0000591 0.3451723 0.16321 0.00007 0.0000644 0.0001089 -0.0790123 0.0373257 -0.6407924 0.0000059 -1.1708937 0.4462931 -0.0001272 -0.0001762 0.0001152 -0.2336839 -0.5258679 -0.2865932 -0.0000634 0.390796 0.1069195 0.0000716 0.0000342 -0.000046 -0.1986566 0.149901 -0.0464024 -0.000008 0.0116133 0.0651802 -0.0000106 -0.0000143 -0.0000119 0.16704 0.0850564 0.0719632 0.0000001 0.0216901 0.0773382 -0.0000101 0.0000373 -0.0000441 0.1696135 0.0122546 -0.0594923 -0.000025 -0.0403303 -0.0836366 -0.0000255 -0.000064 0.000008 0.1683551 0.2756744 0.0442142 0. -0.0346306 0.2467675 -0.0000146 -0.0001101 0.0000484 0.3661947 0.2410052 0.0608606 -0.0000094 0.1141546 0.1558154 0.000008 -0.0000644 -0.0000299 0.3814991 unknown
polarizability: 189.2036857|-14.0426389|133.8906786|0.0221987|0.0046134|36.863894 unknown
InChI: InChI=1S/C6H5IN2O2/c7-5-3-4(9(10)11)1-2-6(5)8/h1-3H,8H2
charge 0 multiplicity 1
16 atoms
I  -2.760886 2.299088 -0.000278
O  3.229784 -0.757369 0.000468
O  2.746652 1.476371 0.000665
N  2.391715 0.230746 0.000177
N  -3.156923 -0.991459 -0.000483
C  0.958974 -0.083239 -0.000007
C  -1.814189 -0.679181 -0.000337
C  0.022839 0.978097 -0.000058
C  0.538071 -1.433932 -0.000175
C  -1.343439 0.676028 -0.000219
C  -0.829639 -1.721033 -0.000314
H  0.391648 2.006728 0.000065
H  1.289504 -2.227363 -0.000159
H  -1.169248 -2.762723 -0.000415
H  -3.859917 -0.253285 -0.000585
H  -3.464348 -1.959974 -0.000645
