program: Gaussian 09
title: 000222599
version: EM64L-G09RevD.01
frameworkgroup: C1[X(C11H10N2O2)]
method: RPBEPBE
basis: SDD
operation: Freq
keyword: #p
keyword: freq=noraman
keyword: PBEPBE/SDD
title: #p freq=noraman PBEPBE/SDD
converged: YES YES NO NO
title: Mulliken charges:
elementType: O O N N C C C C C C C C C C C H H H H H H H H H H
charge: -0.264607 -0.295802 -0.403132 -0.364947 0.150432 0.230707 0.241449 -0.320448 -0.373384 -0.349176 -0.040661 -0.241375 -0.210445 0.164576 -0.615523 0.318149 0.323757 0.285492 0.233233 0.226273 0.225904 0.347651 0.231513 0.231529 0.268836
chargesum: 0.00000
title: Mulliken charges with hydrogens summed into heavy atoms:
elementType: O O N N C C C C C C C C C C C
charge: -0.264607 -0.295802 -0.084983 -0.017296 0.150432 0.230707 0.241449 0.003308 -0.087893 -0.115942 -0.040661 -0.015103 0.015459 0.164576 0.116356
polarizability: 2.24238946e+02 6.92563936e+00 1.50416548e+02 -2.20999062e-02 6.27362844e-03 5.95786290e+01
1716.lowfreq: -8.3216 -5.5269 -1.2200 0.0001 0.0004 0.0009 44.3034 56.2779 105.8311
frequency: 44.2843 56.2743 105.8300 106.5945 127.3175 168.8056 195.2169 224.5491 262.0173 286.3970 344.3752 395.7075 425.1986 446.1029 492.3072 534.5648 575.6283 591.8807 604.5722 638.2966 642.8733 753.8020 759.5463 760.3751 762.4014 767.3858 801.9465 861.0913 868.7423 881.8167 890.4286 949.2200 990.3609 1010.5045 1039.5200 1085.6635 1120.1964 1124.0475 1149.4987 1151.5376 1168.4431 1207.6981 1239.6743 1247.4310 1290.8271 1357.2933 1391.7520 1421.5297 1427.2253 1449.2416 1457.4015 1482.0180 1484.0113 1495.0418 1510.1757 1572.6376 1591.4693 1619.3331 1632.3492 2977.9624 3056.6315 3104.7810 3130.1441 3142.1489 3161.2823 3184.8978 3243.6509 3465.8574 3595.5310
redmass: 5.0008 6.1544 1.0651 4.5047 5.4560 3.7532 5.4111 4.1259 5.7035 5.3720 5.0616 7.7283 2.9396 5.4778 7.9876 7.3664 3.9343 7.7870 1.5762 6.5807 2.0291 1.4094 1.2074 5.1984 3.1153 5.1286 5.0699 4.7719 1.4194 4.9202 1.4279 1.3738 1.3117 2.0873 5.2715 1.7457 1.3023 1.4340 2.0616 1.6207 1.2279 2.1034 1.6998 2.7323 2.4668 2.6432 5.5727 1.2016 2.4806 3.6131 1.3161 2.9134 1.0448 6.4066 1.6697 5.8848 6.6195 8.7393 7.1670 1.0346 1.1018 1.0990 1.0858 1.0914 1.0976 1.0964 1.1003 1.0767 1.0811
irintensity: 4.8112 6.1493 0.3016 2.6321 0.8230 0.0316 9.2421 12.3428 0.0545 0.0808 41.8895 7.4330 11.0414 8.3549 7.9144 4.5721 0.1273 2.1440 81.6962 17.9839 29.9362 2.9701 233.0831 2.2167 1.9351 23.3681 0.5321 3.1784 1.2334 64.3352 14.3312 4.6467 0.8344 10.3254 18.6559 41.8309 0.0105 39.7595 31.6325 49.5073 8.4430 9.7550 31.8537 27.8704 2.6914 30.4743 40.5374 42.9480 107.7810 33.6215 123.0102 4.2821 15.8723 13.8354 309.5512 215.1888 9.3087 142.1632 11.4254 78.7289 34.2408 4.3083 0.1670 18.7474 28.0558 6.6275 26.4294 56.2777 78.7089
temp: 298.150 k
press: 1.00000 atm
elementType: 8 8 7 7 6 6 6 6 6 6 6 6 6 6 6 1 1 1 1 1 1 1 1 1 1
symmnumber: 1
zpe: 503061.5 jmol-1
zpe.correction: 0.191606 hartree
zpe.thermalcorrener: 0.204464 hartree
zpe.thermalcorrenthalpy: 0.205409 hartree
zpe.thermalcorrgfe: 0.151607 hartree
zpe.sumelectzpe: -684.093964 hartree
zpe.sumelectthermal: -684.081105 hartree
zpe.sumelectthermalent: -684.080161 hartree
zpe.sumelectthermalfe: -684.133963 hartree
dipole: 1.1779 1.8545 0.0064
dipole: 2.1969
quadrupole: -66.0401 -78.1144 -90.8479
quadrupole: 12.3274 -0.0169 0.0232
quadrupole: 12.2941 0.2197 -12.5138 12.3274 -0.0169 0.0232
hfenergy: -684.2855696 hartree
pointgroup: C01 [X(C11H10N2O2)]
dipole: 0.4509195 0.6766863 0.2929782 debye
dipolederiv: -0.8120432 -0.0264472 -0.0601887 -0.6073866 -0.8538622 -0.2492675 -0.2674544 -0.1875808 -0.4326771 -0.8169195 0.1161074 -0.0070717 -0.1976436 -0.819674 -0.1834488 -0.1189545 -0.1499893 -0.4285709 -0.9427156 -0.4190913 -0.2232307 0.0094285 -0.3795201 -0.0430782 -0.0697062 -0.0886861 -0.2956322 -1.1272021 -0.3091579 -0.1820061 -0.1297772 -0.5204095 -0.0387165 -0.117742 -0.0577509 -0.48262 0.3895011 -0.1029315 0.0029438 -0.1323644 -0.1345114 -0.0675477 -0.00737 -0.0643631 -0.0091677 0.1414104 -0.0729074 -0.0141743 -0.5643153 0.1581626 -0.013831 -0.1903786 0.0384013 0.022677 -0.8512911 -0.2727001 -0.1789353 -0.650304 -0.4634041 -0.2035491 -0.314269 -0.1633851 -0.180134 0.4898187 0.5269737 0.2465393 0.7910368 0.3441325 0.2257203 0.3411552 0.1974262 0.0562203 -0.1344254 0.0136767 0.0051358 0.0867026 0.0427895 0.0734435 0.0313398 0.0656677 -0.1093314 -0.0104387 0.0168135 0.0242842 0.1132726 0.0122794 0.081768 0.0588813 0.0714966 -0.1502474 1.3320026 0.2759364 0.2214666 0.9005015 0.819593 0.3241263 0.44441 0.2577387 0.320865 0.0004679 -0.0136922 0.0136705 -0.0274943 0.0991157 0.0952647 0.0086531 0.0967211 -0.138838 0.0443879 -0.004668 0.0211875 -0.0179799 -0.0799315 0.0304909 0.0164351 0.0318924 -0.1570412 1.0504435 0.2733788 0.1874444 0.4779371 0.9213982 0.3063247 0.2603547 0.2847982 0.3306756 0.5232714 0.0656498 0.0514852 -0.2145497 0.0449323 -0.0996324 -0.0484874 -0.0698376 0.2306737 0.1551062 -0.002832 -0.0202997 0.0559966 0.2540221 -0.0234047 0.0008185 -0.0297167 0.3253269 0.2307444 0.0338429 0.0163516 0.0430558 0.1191851 -0.0213605 0.0197699 -0.0221688 0.1856817 0.0823645 -0.0756807 -0.0356523 -0.0277773 0.0569408 -0.040778 -0.0184364 -0.0458363 0.143864 0.022477 -0.0588976 -0.037658 -0.0999666 -0.0228584 -0.0825795 -0.0523824 -0.0781861 0.1440939 0.0346392 0.0802466 0.0152621 0.0990654 -0.0645351 -0.0706901 0.0220189 -0.0726976 0.1380708 -0.1398816 0.0311319 -0.0210738 0.036236 0.0954166 -0.0203652 -0.0192338 -0.0209068 0.1533717 0.3746348 0.0556746 0.0235786 -0.0040781 0.2302476 -0.0390416 0.001842 -0.0328304 0.3272347 -0.1081739 -0.074514 0.0384773 -0.0824956 0.023908 0.1127658 0.1148089 0.1049093 0.0197602 -0.0673094 -0.0162465 -0.0746952 0.0270143 0.1292921 -0.0152498 -0.1385835 -0.011138 -0.1266109 0.1391309 -0.0396658 -0.0128411 0.1158853 -0.0127091 -0.0373638 0.0425108 -0.0539777 0.1123552 unknown
polarizability: 222.4032872|1.92985|139.9569732|18.0126456|28.9861847|71.8738624 unknown
InChI: InChI=1S/C11H10N2O2/c1-12-11(15)10(14)8-6-13-9-5-3-2-4-7(8)9/h2-6,12-13H,1H3
charge 0 multiplicity 1
25 atoms
O  -1.232172 -1.465977 -0.910015
O  -2.810922 1.641029 0.029297
N  1.34835 2.093857 0.639028
N  -3.647072 -0.391189 -0.782245
C  1.310524 -0.059265 -0.136881
C  2.171898 0.987866 0.330302
C  -0.057219 0.461026 -0.096099
C  0.025567 1.786442 0.387751
C  1.878673 -1.299013 -0.521237
C  3.570098 0.843542 0.427467
C  -1.254318 -0.25843 -0.48078
C  3.278132 -1.454465 -0.428063
C  4.113751 -0.400016 0.039263
C  -2.639375 0.446269 -0.377034
C  -5.055758 -0.001874 -0.79476
H  1.680102 2.988849 0.995462
H  -0.794047 2.482863 0.549771
H  1.232727 -2.104563 -0.87906
H  4.213606 1.654022 0.786659
H  3.735448 -2.40594 -0.720873
H  5.196466 -0.555982 0.098585
H  -3.339718 -1.325267 -1.081824
H  -5.655708 -0.653517 -0.132761
H  -5.475061 -0.054239 -1.816678
H  -5.124575 1.036872 -0.432575
